{"text_format":"1","workbook":"xlsx","n_sheets":3,"sheets":["Calculation","Per Diem Rates","Formula"],"not_rendered":{"charts":0,"images":1,"macros":1,"external_links":0,"defined_names":0,"comments":1,"pivot_tables":0},"unopened":[],"bounds":{"document_bytes":16777216,"sheet_cells":100000,"rows_first":2000,"rows_last":500,"rows_between":2000,"halvings":0,"cell_chars":16384,"cell_head_chars":4096},"cells_cut":0,"cells_raw":0,"read":"whole","date_system":"1900"}

{"sheet":"Calculation","index":0,"n_rows":75,"n_cols":10,"rows_kept":75,"cut":false,"hidden":false,"merged":[[84,4,84,8],[84,9,84,12],[29,4,29,12],[81,4,81,8],[81,9,81,12],[82,4,82,8],[82,9,82,12],[83,4,83,8],[83,9,83,12],[78,4,78,8],[78,9,78,12],[79,4,79,8],[79,9,79,12],[80,4,80,8],[80,9,80,12],[75,4,75,8],[75,9,75,12],[76,4,76,8],[76,9,76,12],[77,4,77,8],[77,9,77,12],[72,4,72,8],[72,9,72,12],[73,4,73,8],[73,9,73,12],[74,4,74,8],[74,9,74,12],[69,4,69,8],[69,9,69,12],[70,4,70,8],[70,9,70,12],[71,4,71,8],[71,9,71,12],[66,4,66,8],[66,9,66,12],[67,4,67,8],[67,9,67,12],[68,4,68,8],[68,9,68,12],[63,4,63,8],[63,9,63,12],[64,4,64,8],[64,9,64,12],[65,4,65,8],[65,9,65,12],[60,4,60,8],[60,9,60,12],[61,4,61,8],[61,9,61,12],[62,4,62,8],[62,9,62,12],[57,4,57,8],[57,9,57,12],[58,4,58,8],[58,9,58,12],[59,4,59,8],[59,9,59,12],[54,4,54,8],[54,9,54,12],[55,4,55,8],[55,9,55,12],[56,4,56,8],[56,9,56,12],[50,4,50,8],[50,9,50,12],[51,4,51,8],[51,9,51,12],[52,4,52,8],[52,9,52,12],[53,4,53,8],[53,9,53,12],[47,4,47,8],[47,9,47,12],[48,4,48,8],[48,9,48,12],[49,4,49,8],[49,9,49,12],[44,4,44,8],[44,9,44,12],[45,4,45,8],[45,9,45,12],[46,4,46,8],[46,9,46,12],[42,9,42,12],[43,9,43,12],[36,4,36,8],[37,4,37,8],[38,4,38,8],[39,4,39,8],[40,4,40,8],[41,4,41,8],[42,4,42,8],[43,4,43,8],[37,9,37,12],[38,9,38,12],[39,9,39,12],[40,9,40,12],[41,9,41,12],[35,4,35,8],[35,9,35,12],[36,9,36,12],[26,7,26,12],[23,7,23,12],[30,4,32,12],[33,5,33,12],[34,4,34,5],[34,6,34,12]]}
[null,null,null,null,"Ariba won't accept this specific excel filetype as an attachment."]
[null,null,null,null,"Please save as PDF or print>scan, and attach to the expense report."]
[]
[null,"Traveler included in meal ?","Yes",null,{"$f":"IF(C20=\"no\",\"     Tax Charged\",\"\")","v":"     Tax Charged"},{"$f":"IF(C20=\"No\",C14,\"\")","v":1}]
[null,"Number of all \"other\" participants, all must be on Travel Status",1,null,null,{"$f":"IF(C20=\"No\",C13,\"\")","v":1}]
[null,null,null,null,{"$f":"IF(C20=\"no\",\"     Tax Rate\",\"\")","v":"     Tax Rate"},{"$f":"IF(C20=\"No\",(F4/F5),\"\")","v":1}]
[null,"Meal per diem rate for travel location",10]
[null,"Meal purchased","Dinner",null,{"$f":"IF(C20=\"no\",\"     ( Sub Total - Alcohol )\",\"     ( Total - Alcohol )\")","v":"     ( Sub Total - Alcohol )"},{"$f":"IF(C20=\"No\",C13,C21)","v":1},"-",{"$f":"IF(C20=\"No\",C11,C11)","v":0},"=",{"$f":"IF(C20=\"No\",(F8-H8),(F8-H8))","v":1}]
[null,"Per Diem Rate",{"$f":"INDEX('Per Diem Rates'!$D$3:$D$1661,MATCH(Calculation!C7,IF('Per Diem Rates'!$C$3:$C$1661=Calculation!C8,'Per Diem Rates'!$B$3:$B$1661),0))","v":5},null,{"$f":"IF(C20=\"no\",\"     ( 1 + Tax Rate )\",\"\")","v":"     ( 1 + Tax Rate )"},{"$f":"IF(C20=\"no\",1,\"\")","v":1},{"$f":"IF(C20=\"no\",\"+\",\"\")","v":"+"},{"$f":"IF(C20=\"No\",F6,\"\")","v":1},{"$f":"IF(C20=\"no\",\"=\",\"\")","v":"="},{"$f":"IF(C20=\"No\",(F9+H9),\"\")","v":2}]
[null,null,null,null,"     Claimed",null,null,null,null,{"$f":"IF(C20=\"No\",(J8*J9),(J8))","v":2}]
[null,"Alcohol",0]
[null,null,null,null,"     Claimed",{"$f":"IF(C20=\"No\",J10,J10)","v":2}]
[null,{"$f":"IF(C20=\"Yes\",\"Calculation uses data in yellow cells below, disregard this cell >\",\"Sub Total\")","v":"Sub Total"},1,null," +  Tip",{"$f":"IF(C20=\"No\",C16,C22)","v":1}]
[null,{"$f":"IF(C20=\"Yes\",\"Calculation uses data in yellow cells below, disregard this cell >\",\"Tax Charged\")","v":"Tax Charged"},1,null," -  Traveler's Per Diem",{"$f":"IF(C4=\"No\",0,C9)","v":5}]
[null,{"$f":"IF(C20=\"Yes\",\"Calculation uses data in yellow cells below, disregard this cell >\",\"Total\")","v":"Total"},{"$f":"C13+C14","v":2},null,"     MPO Claimed",{"$f":"IF((F12+F13-F14)<0,0,(F12+F13-F14))","v":0}]
[null,{"$f":"IF(C20=\"Yes\",\"Calculation uses data in yellow cells below, disregard this cell >\",\"Tip\")","v":"Tip"},1]
[null,null,null,null,"     MPO Claimed",{"$f":"F15","v":0}]
[null,"Grand Total",{"$f":"IF(C20=\"yes\",(C21+C22),(C13+C14+C16))","v":3},null," /  # of Participants",{"$f":"C5","v":1}]
[null,null,null,null,"     Average Meal Cost",{"$f":"F17/F18","v":0}]
[null,"Receipt ONLY shows Total & Tip ?","No"]
[null,{"$f":"IF(C20=\"Yes\",\"Total\",\"Calculation uses data in blue cells above, disregard this cell >\")","v":"Calculation uses data in blue cells above, disregard this cell >"},0,null,"Per Diem Rate Violation",{"$f":"IF(F19<C9, \"No\", \"Yes\")","v":"No"}]
[null,{"$f":"IF(C20=\"Yes\",\"Tip\",\"Calculation uses data in blue cells above, disregard this cell >\")","v":"Calculation uses data in blue cells above, disregard this cell >"},0]
[null,null,null,null,"Meals Paid for Others"]
[null,"I N S T R U C T I O N S",null,null,"Reimbursable",{"$f":"IF(F19<C9, (F19*C5), (C9*C5))","v":0},">","Reimbursed on the Meals Paid for Others line."]
[null,"◊ Choose Yes/No regarding the Traveler's participation",null,null,"Over Per Diem",{"$f":"IF(C4=\"No\",IF(F15<=0,0,(MAX(0,(F19*C5)-(C9*C5)))),IF(F19<C9,0,((F19*C5)-(C9*C5))))","v":0},">","Only on a 64x budget with a UW business reason."]
[null,"◊ Enter the # of Participants, DO NOT include the traveler",null,null,"Alcohol",{"$f":"IF(C20=\"No\", (C11*(1+F6)), (C11))","v":0},">","Includes tax, alcohol taxes for location is unknown."]
[null,null,null,null,"Traveler Per Diem",{"$f":"IF(C4=\"No\",0,IF(C20=\"yes\",IF(F12+F13<C9,F12+F13,C9),IF(F12+F13<C9,F12+F13,C9)))","v":3},">","Reimburse on the Traveler's Per Diem Meals line."]
[null,"◊ Select the total allowed per diem for travel location. ",null,null,"Grand Total",{"$f":"F24+F26+F25+F27","v":3}]
[null,"This information can be found on the GSA site"]
[null,"http://www.gsa.gov/portal/content/104877",null,null,"UW Business Reason :"]
[null,"and attach proof to the expense report.",null,null,"[[ Enter information ]]"]
[null,"◊ Select the claimed meal."]
[null,"◊ The per diem rate for the location and meal will auto-calculate."]
[null,"Meal breakdown is 25% for breakfast.",null,null,"Name of Traveler :","[[ Enter information ]]"]
[null,"Meal breakdown is 30% for lunch.",null,null,"Location of Meal (City, State) :",null,"[[ Enter information ]]"]
[null,"Meal breakdown is 45% for dinner.",null,null,"Participant Name :",null,null,null,null,"Duty/Home Station (City, State) :"]
[null,null,null,null,"[[ Enter information ]]",null,null,null,null,"[[ Enter information ]]"]
[null,"◊ Enter the total for alcohol.",null,null,""]
[null,null,null,null,""]
[null,"◊ Enter the sub total found on the receipt.",null,null,""]
[null,"The sub total should include all alcohol expenses.",null,null,""]
[null,"◊ Enter the taxes charged on the sub total, found on the receipt.",null,null,""]
[null,"If the alcohol is charged separate taxes, do not include.",null,null,""]
[null,"◊ Enter the total found on the receipt. ",null,null,""]
[null,"◊ Enter the tip amount.",null,null,""]
[null,"Tips are an incidental cost.",null,null,""]
[null,"Incidentals are included in the meals per diem rate.",null,null,""]
[null,null,null,null,""]
[null,"◊ The Grand Total should be the sum of the receipt total and tip.",null,null,""]
[null,"Utilize this data to double check that inputs are correct.",null,null,""]
[null,null,null,null,""]
[null,"◊ Choose Yes if the receipt doesn't show the sub-total or taxes.",null,null,""]
[null,"Receipt must still be itemized for food items.",null,null,""]
[null,"Receipt only shows the grand total ?",null,null,""]
[null,"No sub-total and tax calculation available ?",null,null,""]
[null,"Select Yes, and enter the amounts below.",null,null,""]
[null,"◊ If Yes is selected above, enter the total.",null,null,""]
[null,"◊ If Yes is selected above, enter the tip amount.",null,null,""]
[null,null,null,null,""]
[null,null,null,null,""]
[null,null,null,null,""]
[null,null,null,null,""]
[null,null,null,null,""]
[null,null,null,null,""]
[null,null,null,null,""]
[null,null,null,null,""]
[null,null,null,null,""]
[null,null,null,null,""]
[null,null,null,null,""]
[null,null,null,null,""]
[null,null,null,null,""]
[null,null,null,null,""]
[null,null,null,null,""]
[null,null,null,null,""]
[null,null,null,null,""]

{"sheet":"Per Diem Rates","index":1,"n_rows":1661,"n_cols":13,"rows_kept":1661,"cut":false,"hidden":true,"merged":[]}
[]
[null,"Per Diem Daily Limit","Meal","Per Diem Allowance",null,"Total","Ariba Chk",null,"Data V #1",null,"Data V #2",null,"Data V #3"]
[null,3,"Breakfast",{"$f":"ROUND(B3*0.25,0)","v":1},null,null,null,null,"Breakfast",null,3,null,"Yes"]
[null,{"$f":"B3","v":3},"Lunch",{"$f":"ROUND(B3*0.3,0)","v":1},null,null,null,null,"Lunch",null,4,null,"No"]
[null,{"$f":"B3","v":3},"Dinner",{"$f":"ROUND(B3*0.45,0)","v":1},null,{"$f":"(D4+D3+D5)","v":3},{"$f":"(D4+D3+D5)-F5","v":0},null,"Dinner",null,5]
[null,4,"Breakfast",{"$f":"ROUND(B6*0.25,0)","v":1},null,null,null,null,null,null,6]
[null,{"$f":"B6","v":4},"Lunch",{"$f":"ROUND(B6*0.3,0)","v":1},null,null,null,null,null,null,7]
[null,{"$f":"B6","v":4},"Dinner",{"$f":"ROUND(B6*0.45,0)","v":2},null,{"$f":"(D7+D6+D8)","v":4},{"$f":"(D7+D6+D8)-F8","v":0},null,null,null,8]
[null,5,"Breakfast",{"$f":"ROUND(B9*0.25,0)","v":1},null,null,null,null,null,null,9]
[null,{"$f":"B9","v":5},"Lunch",{"$f":"ROUND(B9*0.3,0)","v":2},null,null,null,null,null,null,10]
[null,{"$f":"B9","v":5},"Dinner",{"$f":"ROUND(B9*0.45,0)","v":2},null,{"$f":"(D10+D9+D11)","v":5},{"$f":"(D10+D9+D11)-F11","v":0},null,null,null,11]
[null,6,"Breakfast",{"$f":"ROUND(B12*0.25,0)","v":2},null,null,null,null,null,null,12]
[null,{"$f":"B12","v":6},"Lunch",{"$f":"ROUND(B12*0.3,0)","v":2},null,null,null,null,null,null,13]
[null,{"$f":"B12","v":6},"Dinner",{"$f":"ROUND(B12*0.45,0)","v":3},null,{"$f":"(D13+D12+D14)","v":7},{"$f":"(D13+D12+D14)-F14","v":0},null,null,null,14]
[null,7,"Breakfast",{"$f":"ROUND(B15*0.25,0)","v":2},null,null,null,null,null,null,15]
[null,{"$f":"B15","v":7},"Lunch",{"$f":"ROUND(B15*0.3,0)","v":2},null,null,null,null,null,null,16]
[null,{"$f":"B15","v":7},"Dinner",{"$f":"ROUND(B15*0.45,0)","v":3},null,{"$f":"(D16+D15+D17)","v":7},{"$f":"(D16+D15+D17)-F17","v":0},null,null,null,17]
[null,8,"Breakfast",{"$f":"ROUND(B18*0.25,0)","v":2},null,null,null,null,null,null,18]
[null,{"$f":"B18","v":8},"Lunch",{"$f":"ROUND(B18*0.3,0)","v":2},null,null,null,null,null,null,19]
[null,{"$f":"B18","v":8},"Dinner",{"$f":"ROUND(B18*0.45,0)","v":4},null,{"$f":"(D19+D18+D20)","v":8},{"$f":"(D19+D18+D20)-F20","v":0},null,null,null,20]
[null,9,"Breakfast",{"$f":"ROUND(B21*0.25,0)","v":2},null,null,null,null,null,null,21]
[null,{"$f":"B21","v":9},"Lunch",{"$f":"ROUND(B21*0.3,0)","v":3},null,null,null,null,null,null,22]
[null,{"$f":"B21","v":9},"Dinner",{"$f":"ROUND(B21*0.45,0)","v":4},null,{"$f":"(D22+D21+D23)","v":9},{"$f":"(D22+D21+D23)-F23","v":0},null,null,null,23]
[null,10,"Breakfast",{"$f":"ROUND(B24*0.25,0)","v":3},null,null,null,null,null,null,24]
[null,{"$f":"B24","v":10},"Lunch",{"$f":"ROUND(B24*0.3,0)","v":3},null,null,null,null,null,null,25]
[null,{"$f":"B24","v":10},"Dinner",{"$f":"ROUND(B24*0.45,0)","v":5},null,{"$f":"(D25+D24+D26)","v":11},{"$f":"(D25+D24+D26)-F26","v":0},null,null,null,26]
[null,11,"Breakfast",{"$f":"ROUND(B27*0.25,0)","v":3},null,null,null,null,null,null,27]
[null,{"$f":"B27","v":11},"Lunch",{"$f":"ROUND(B27*0.3,0)","v":3},null,null,null,null,null,null,28]
[null,{"$f":"B27","v":11},"Dinner",{"$f":"ROUND(B27*0.45,0)","v":5},null,{"$f":"(D28+D27+D29)","v":11},{"$f":"(D28+D27+D29)-F29","v":0},null,null,null,29]
[null,12,"Breakfast",{"$f":"ROUND(B30*0.25,0)","v":3},null,null,null,null,null,null,30]
[null,{"$f":"B30","v":12},"Lunch",{"$f":"ROUND(B30*0.3,0)","v":4},null,null,null,null,null,null,31]
[null,{"$f":"B30","v":12},"Dinner",{"$f":"ROUND(B30*0.45,0)","v":5},null,{"$f":"(D31+D30+D32)","v":12},{"$f":"(D31+D30+D32)-F32","v":0},null,null,null,32]
[null,13,"Breakfast",{"$f":"ROUND(B33*0.25,0)","v":3},null,null,null,null,null,null,33]
[null,{"$f":"B33","v":13},"Lunch",{"$f":"ROUND(B33*0.3,0)","v":4},null,null,null,null,null,null,34]
[null,{"$f":"B33","v":13},"Dinner",{"$f":"ROUND(B33*0.45,0)","v":6},null,{"$f":"(D34+D33+D35)","v":13},{"$f":"(D34+D33+D35)-F35","v":0},null,null,null,35]
[null,14,"Breakfast",{"$f":"ROUND(B36*0.25,0)","v":4},null,null,null,null,null,null,36]
[null,{"$f":"B36","v":14},"Lunch",{"$f":"ROUND(B36*0.3,0)","v":4},null,null,null,null,null,null,37]
[null,{"$f":"B36","v":14},"Dinner",{"$f":"ROUND(B36*0.45,0)","v":6},null,{"$f":"(D37+D36+D38)","v":14},{"$f":"(D37+D36+D38)-F38","v":0},null,null,null,38]
[null,15,"Breakfast",{"$f":"ROUND(B39*0.25,0)","v":4},null,null,null,null,null,null,39]
[null,{"$f":"B39","v":15},"Lunch",{"$f":"ROUND(B39*0.3,0)","v":5},null,null,null,null,null,null,40]
[null,{"$f":"B39","v":15},"Dinner",{"$f":"ROUND(B39*0.45,0)","v":7},null,{"$f":"(D40+D39+D41)","v":16},{"$f":"(D40+D39+D41)-F41","v":0},null,null,null,41]
[null,16,"Breakfast",{"$f":"ROUND(B42*0.25,0)","v":4},null,null,null,null,null,null,42]
[null,{"$f":"B42","v":16},"Lunch",{"$f":"ROUND(B42*0.3,0)","v":5},null,null,null,null,null,null,43]
[null,{"$f":"B42","v":16},"Dinner",{"$f":"ROUND(B42*0.45,0)","v":7},null,{"$f":"(D43+D42+D44)","v":16},{"$f":"(D43+D42+D44)-F44","v":0},null,null,null,44]
[null,17,"Breakfast",{"$f":"ROUND(B45*0.25,0)","v":4},null,null,null,null,null,null,45]
[null,{"$f":"B45","v":17},"Lunch",{"$f":"ROUND(B45*0.3,0)","v":5},null,null,null,null,null,null,46]
[null,{"$f":"B45","v":17},"Dinner",{"$f":"ROUND(B45*0.45,0)","v":8},null,{"$f":"(D46+D45+D47)","v":17},{"$f":"(D46+D45+D47)-F47","v":0},null,null,null,47]
[null,18,"Breakfast",{"$f":"ROUND(B48*0.25,0)","v":5},null,null,null,null,null,null,48]
[null,{"$f":"B48","v":18},"Lunch",{"$f":"ROUND(B48*0.3,0)","v":5},null,null,null,null,null,null,49]
[null,{"$f":"B48","v":18},"Dinner",{"$f":"ROUND(B48*0.45,0)","v":8},null,{"$f":"(D49+D48+D50)","v":18},{"$f":"(D49+D48+D50)-F50","v":0},null,null,null,50]
[null,19,"Breakfast",{"$f":"ROUND(B51*0.25,0)","v":5},null,null,null,null,null,null,51]
[null,{"$f":"B51","v":19},"Lunch",{"$f":"ROUND(B51*0.3,0)","v":6},null,null,null,null,null,null,52]
[null,{"$f":"B51","v":19},"Dinner",{"$f":"ROUND(B51*0.45,0)","v":9},null,{"$f":"(D52+D51+D53)","v":20},{"$f":"(D52+D51+D53)-F53","v":0},null,null,null,53]
[null,20,"Breakfast",{"$f":"ROUND(B54*0.25,0)","v":5},null,null,null,null,null,null,54]
[null,{"$f":"B54","v":20},"Lunch",{"$f":"ROUND(B54*0.3,0)","v":6},null,null,null,null,null,null,55]
[null,{"$f":"B54","v":20},"Dinner",{"$f":"ROUND(B54*0.45,0)","v":9},null,{"$f":"(D55+D54+D56)","v":20},{"$f":"(D55+D54+D56)-F56","v":0},null,null,null,56]
[null,21,"Breakfast",{"$f":"ROUND(B57*0.25,0)","v":5},null,null,null,null,null,null,57]
[null,{"$f":"B57","v":21},"Lunch",{"$f":"ROUND(B57*0.3,0)","v":6},null,null,null,null,null,null,58]
[null,{"$f":"B57","v":21},"Dinner",{"$f":"ROUND(B57*0.45,0)","v":9},null,{"$f":"(D58+D57+D59)","v":20},{"$f":"(D58+D57+D59)-F59","v":0},null,null,null,59]
[null,22,"Breakfast",{"$f":"ROUND(B60*0.25,0)","v":6},null,null,null,null,null,null,60]
[null,{"$f":"B60","v":22},"Lunch",{"$f":"ROUND(B60*0.3,0)","v":7},null,null,null,null,null,null,61]
[null,{"$f":"B60","v":22},"Dinner",{"$f":"ROUND(B60*0.45,0)","v":10},null,{"$f":"(D61+D60+D62)","v":23},{"$f":"(D61+D60+D62)-F62","v":0},null,null,null,62]
[null,23,"Breakfast",{"$f":"ROUND(B63*0.25,0)","v":6},null,null,null,null,null,null,63]
[null,{"$f":"B63","v":23},"Lunch",{"$f":"ROUND(B63*0.3,0)","v":7},null,null,null,null,null,null,64]
[null,{"$f":"B63","v":23},"Dinner",{"$f":"ROUND(B63*0.45,0)","v":10},null,{"$f":"(D64+D63+D65)","v":23},{"$f":"(D64+D63+D65)-F65","v":0},null,null,null,65]
[null,24,"Breakfast",{"$f":"ROUND(B66*0.25,0)","v":6},null,null,null,null,null,null,66]
[null,{"$f":"B66","v":24},"Lunch",{"$f":"ROUND(B66*0.3,0)","v":7},null,null,null,null,null,null,67]
[null,{"$f":"B66","v":24},"Dinner",{"$f":"ROUND(B66*0.45,0)","v":11},null,{"$f":"(D67+D66+D68)","v":24},{"$f":"(D67+D66+D68)-F68","v":0},null,null,null,68]
[null,25,"Breakfast",{"$f":"ROUND(B69*0.25,0)","v":6},null,null,null,null,null,null,69]
[null,{"$f":"B69","v":25},"Lunch",{"$f":"ROUND(B69*0.3,0)","v":8},null,null,null,null,null,null,70]
[null,{"$f":"B69","v":25},"Dinner",{"$f":"ROUND(B69*0.45,0)","v":11},null,{"$f":"(D70+D69+D71)","v":25},{"$f":"(D70+D69+D71)-F71","v":0},null,null,null,71]
[null,26,"Breakfast",{"$f":"ROUND(B72*0.25,0)","v":7},null,null,null,null,null,null,72]
[null,{"$f":"B72","v":26},"Lunch",{"$f":"ROUND(B72*0.3,0)","v":8},null,null,null,null,null,null,73]
[null,{"$f":"B72","v":26},"Dinner",{"$f":"ROUND(B72*0.45,0)","v":12},null,{"$f":"(D73+D72+D74)","v":27},{"$f":"(D73+D72+D74)-F74","v":0},null,null,null,74]
[null,27,"Breakfast",{"$f":"ROUND(B75*0.25,0)","v":7},null,null,null,null,null,null,75]
[null,{"$f":"B75","v":27},"Lunch",{"$f":"ROUND(B75*0.3,0)","v":8},null,null,null,null,null,null,76]
[null,{"$f":"B75","v":27},"Dinner",{"$f":"ROUND(B75*0.45,0)","v":12},null,{"$f":"(D76+D75+D77)","v":27},{"$f":"(D76+D75+D77)-F77","v":0},null,null,null,77]
[null,28,"Breakfast",{"$f":"ROUND(B78*0.25,0)","v":7},null,null,null,null,null,null,78]
[null,{"$f":"B78","v":28},"Lunch",{"$f":"ROUND(B78*0.3,0)","v":8},null,null,null,null,null,null,79]
[null,{"$f":"B78","v":28},"Dinner",{"$f":"ROUND(B78*0.45,0)","v":13},null,{"$f":"(D79+D78+D80)","v":28},{"$f":"(D79+D78+D80)-F80","v":0},null,null,null,80]
[null,29,"Breakfast",{"$f":"ROUND(B81*0.25,0)","v":7},null,null,null,null,null,null,81]
[null,{"$f":"B81","v":29},"Lunch",{"$f":"ROUND(B81*0.3,0)","v":9},null,null,null,null,null,null,82]
[null,{"$f":"B81","v":29},"Dinner",{"$f":"ROUND(B81*0.45,0)","v":13},null,{"$f":"(D82+D81+D83)","v":29},{"$f":"(D82+D81+D83)-F83","v":0},null,null,null,83]
[null,30,"Breakfast",{"$f":"ROUND(B84*0.25,0)","v":8},null,null,null,null,null,null,84]
[null,{"$f":"B84","v":30},"Lunch",{"$f":"ROUND(B84*0.3,0)","v":9},null,null,null,null,null,null,85]
[null,{"$f":"B84","v":30},"Dinner",{"$f":"ROUND(B84*0.45,0)","v":14},null,{"$f":"(D85+D84+D86)","v":31},{"$f":"(D85+D84+D86)-F86","v":0},null,null,null,86]
[null,31,"Breakfast",{"$f":"ROUND(B87*0.25,0)","v":8},null,null,null,null,null,null,87]
[null,{"$f":"B87","v":31},"Lunch",{"$f":"ROUND(B87*0.3,0)","v":9},null,null,null,null,null,null,88]
[null,{"$f":"B87","v":31},"Dinner",{"$f":"ROUND(B87*0.45,0)","v":14},null,{"$f":"(D88+D87+D89)","v":31},{"$f":"(D88+D87+D89)-F89","v":0},null,null,null,89]
[null,32,"Breakfast",{"$f":"ROUND(B90*0.25,0)","v":8},null,null,null,null,null,null,90]
[null,{"$f":"B90","v":32},"Lunch",{"$f":"ROUND(B90*0.3,0)","v":10},null,null,null,null,null,null,91]
[null,{"$f":"B90","v":32},"Dinner",{"$f":"ROUND(B90*0.45,0)","v":14},null,{"$f":"(D91+D90+D92)","v":32},{"$f":"(D91+D90+D92)-F92","v":0},null,null,null,92]
[null,33,"Breakfast",{"$f":"ROUND(B93*0.25,0)","v":8},null,null,null,null,null,null,93]
[null,{"$f":"B93","v":33},"Lunch",{"$f":"ROUND(B93*0.3,0)","v":10},null,null,null,null,null,null,94]
[null,{"$f":"B93","v":33},"Dinner",{"$f":"ROUND(B93*0.45,0)","v":15},null,{"$f":"(D94+D93+D95)","v":33},{"$f":"(D94+D93+D95)-F95","v":0},null,null,null,95]
[null,34,"Breakfast",{"$f":"ROUND(B96*0.25,0)","v":9},null,null,null,null,null,null,96]
[null,{"$f":"B96","v":34},"Lunch",{"$f":"ROUND(B96*0.3,0)","v":10},null,null,null,null,null,null,97]
[null,{"$f":"B96","v":34},"Dinner",{"$f":"ROUND(B96*0.45,0)","v":15},null,{"$f":"(D97+D96+D98)","v":34},{"$f":"(D97+D96+D98)-F98","v":0},null,null,null,98]
[null,35,"Breakfast",{"$f":"ROUND(B99*0.25,0)","v":9},null,null,null,null,null,null,99]
[null,{"$f":"B99","v":35},"Lunch",{"$f":"ROUND(B99*0.3,0)","v":11},null,null,null,null,null,null,100]
[null,{"$f":"B99","v":35},"Dinner",{"$f":"ROUND(B99*0.45,0)","v":16},null,{"$f":"(D100+D99+D101)","v":36},{"$f":"(D100+D99+D101)-F101","v":0},null,null,null,101]
[null,36,"Breakfast",{"$f":"ROUND(B102*0.25,0)","v":9},null,null,null,null,null,null,102]
[null,{"$f":"B102","v":36},"Lunch",{"$f":"ROUND(B102*0.3,0)","v":11},null,null,null,null,null,null,103]
[null,{"$f":"B102","v":36},"Dinner",{"$f":"ROUND(B102*0.45,0)","v":16},null,{"$f":"(D103+D102+D104)","v":36},{"$f":"(D103+D102+D104)-F104","v":0},null,null,null,104]
[null,37,"Breakfast",{"$f":"ROUND(B105*0.25,0)","v":9},null,null,null,null,null,null,105]
[null,{"$f":"B105","v":37},"Lunch",{"$f":"ROUND(B105*0.3,0)","v":11},null,null,null,null,null,null,106]
[null,{"$f":"B105","v":37},"Dinner",{"$f":"ROUND(B105*0.45,0)","v":17},null,{"$f":"(D106+D105+D107)","v":37},{"$f":"(D106+D105+D107)-F107","v":0},null,null,null,107]
[null,38,"Breakfast",{"$f":"ROUND(B108*0.25,0)","v":10},null,null,null,null,null,null,108]
[null,{"$f":"B108","v":38},"Lunch",{"$f":"ROUND(B108*0.3,0)","v":11},null,null,null,null,null,null,109]
[null,{"$f":"B108","v":38},"Dinner",{"$f":"ROUND(B108*0.45,0)","v":17},null,{"$f":"(D109+D108+D110)","v":38},{"$f":"(D109+D108+D110)-F110","v":0},null,null,null,110]
[null,39,"Breakfast",{"$f":"ROUND(B111*0.25,0)","v":10},null,null,null,null,null,null,111]
[null,{"$f":"B111","v":39},"Lunch",{"$f":"ROUND(B111*0.3,0)","v":12},null,null,null,null,null,null,112]
[null,{"$f":"B111","v":39},"Dinner",{"$f":"ROUND(B111*0.45,0)","v":18},null,{"$f":"(D112+D111+D113)","v":40},{"$f":"(D112+D111+D113)-F113","v":0},null,null,null,113]
[null,40,"Breakfast",{"$f":"ROUND(B114*0.25,0)","v":10},null,null,null,null,null,null,114]
[null,{"$f":"B114","v":40},"Lunch",{"$f":"ROUND(B114*0.3,0)","v":12},null,null,null,null,null,null,115]
[null,{"$f":"B114","v":40},"Dinner",{"$f":"ROUND(B114*0.45,0)","v":18},null,{"$f":"(D115+D114+D116)","v":40},{"$f":"(D115+D114+D116)-F116","v":0},null,null,null,116]
[null,41,"Breakfast",{"$f":"ROUND(B117*0.25,0)","v":10},null,null,null,null,null,null,117]
[null,{"$f":"B117","v":41},"Lunch",{"$f":"ROUND(B117*0.3,0)","v":12},null,null,null,null,null,null,118]
[null,{"$f":"B117","v":41},"Dinner",{"$f":"ROUND(B117*0.45,0)","v":18},null,{"$f":"(D118+D117+D119)","v":40},{"$f":"(D118+D117+D119)-F119","v":0},null,null,null,119]
[null,42,"Breakfast",{"$f":"ROUND(B120*0.25,0)","v":11},null,null,null,null,null,null,120]
[null,{"$f":"B120","v":42},"Lunch",{"$f":"ROUND(B120*0.3,0)","v":13},null,null,null,null,null,null,121]
[null,{"$f":"B120","v":42},"Dinner",{"$f":"ROUND(B120*0.45,0)","v":19},null,{"$f":"(D121+D120+D122)","v":43},{"$f":"(D121+D120+D122)-F122","v":0},null,null,null,122]
[null,43,"Breakfast",{"$f":"ROUND(B123*0.25,0)","v":11},null,null,null,null,null,null,123]
[null,{"$f":"B123","v":43},"Lunch",{"$f":"ROUND(B123*0.3,0)","v":13},null,null,null,null,null,null,124]
[null,{"$f":"B123","v":43},"Dinner",{"$f":"ROUND(B123*0.45,0)","v":19},null,{"$f":"(D124+D123+D125)","v":43},{"$f":"(D124+D123+D125)-F125","v":0},null,null,null,125]
[null,44,"Breakfast",{"$f":"ROUND(B126*0.25,0)","v":11},null,null,null,null,null,null,126]
[null,{"$f":"B126","v":44},"Lunch",{"$f":"ROUND(B126*0.3,0)","v":13},null,null,null,null,null,null,127]
[null,{"$f":"B126","v":44},"Dinner",{"$f":"ROUND(B126*0.45,0)","v":20},null,{"$f":"(D127+D126+D128)","v":44},{"$f":"(D127+D126+D128)-F128","v":0},null,null,null,128]
[null,45,"Breakfast",{"$f":"ROUND(B129*0.25,0)","v":11},null,null,null,null,null,null,129]
[null,{"$f":"B129","v":45},"Lunch",{"$f":"ROUND(B129*0.3,0)","v":14},null,null,null,null,null,null,130]
[null,{"$f":"B129","v":45},"Dinner",{"$f":"ROUND(B129*0.45,0)","v":20},null,{"$f":"(D130+D129+D131)","v":45},{"$f":"(D130+D129+D131)-F131","v":0},null,null,null,131]
[null,46,"Breakfast",{"$f":"ROUND(B132*0.25,0)","v":12},null,null,null,null,null,null,132]
[null,{"$f":"B132","v":46},"Lunch",{"$f":"ROUND(B132*0.3,0)","v":14},null,null,null,null,null,null,133]
[null,{"$f":"B132","v":46},"Dinner",{"$f":"ROUND(B132*0.45,0)","v":21},null,{"$f":"(D133+D132+D134)","v":47},{"$f":"(D133+D132+D134)-F134","v":0},null,null,null,134]
[null,47,"Breakfast",{"$f":"ROUND(B135*0.25,0)","v":12},null,null,null,null,null,null,135]
[null,{"$f":"B135","v":47},"Lunch",{"$f":"ROUND(B135*0.3,0)","v":14},null,null,null,null,null,null,136]
[null,{"$f":"B135","v":47},"Dinner",{"$f":"ROUND(B135*0.45,0)","v":21},null,{"$f":"(D136+D135+D137)","v":47},{"$f":"(D136+D135+D137)-F137","v":0},null,null,null,137]
[null,48,"Breakfast",{"$f":"ROUND(B138*0.25,0)","v":12},null,null,null,null,null,null,138]
[null,{"$f":"B138","v":48},"Lunch",{"$f":"ROUND(B138*0.3,0)","v":14},null,null,null,null,null,null,139]
[null,{"$f":"B138","v":48},"Dinner",{"$f":"ROUND(B138*0.45,0)","v":22},null,{"$f":"(D139+D138+D140)","v":48},{"$f":"(D139+D138+D140)-F140","v":0},null,null,null,140]
[null,49,"Breakfast",{"$f":"ROUND(B141*0.25,0)","v":12},null,null,null,null,null,null,141]
[null,{"$f":"B141","v":49},"Lunch",{"$f":"ROUND(B141*0.3,0)","v":15},null,null,null,null,null,null,142]
[null,{"$f":"B141","v":49},"Dinner",{"$f":"ROUND(B141*0.45,0)","v":22},null,{"$f":"(D142+D141+D143)","v":49},{"$f":"(D142+D141+D143)-F143","v":0},null,null,null,143]
[null,50,"Breakfast",{"$f":"ROUND(B144*0.25,0)","v":13},null,null,null,null,null,null,144]
[null,{"$f":"B144","v":50},"Lunch",{"$f":"ROUND(B144*0.3,0)","v":15},null,null,null,null,null,null,145]
[null,{"$f":"B144","v":50},"Dinner",{"$f":"ROUND(B144*0.45,0)","v":23},null,{"$f":"(D145+D144+D146)","v":51},{"$f":"(D145+D144+D146)-F146","v":0},null,null,null,146]
[null,51,"Breakfast",{"$f":"ROUND(B147*0.25,0)","v":13},null,null,null,null,null,null,147]
[null,{"$f":"B147","v":51},"Lunch",{"$f":"ROUND(B147*0.3,0)","v":15},null,null,null,null,null,null,148]
[null,{"$f":"B147","v":51},"Dinner",{"$f":"ROUND(B147*0.45,0)","v":23},null,{"$f":"(D148+D147+D149)","v":51},{"$f":"(D148+D147+D149)-F149","v":0},null,null,null,149]
[null,52,"Breakfast",{"$f":"ROUND(B150*0.25,0)","v":13},null,null,null,null,null,null,150]
[null,{"$f":"B150","v":52},"Lunch",{"$f":"ROUND(B150*0.3,0)","v":16},null,null,null,null,null,null,151]
[null,{"$f":"B150","v":52},"Dinner",{"$f":"ROUND(B150*0.45,0)","v":23},null,{"$f":"(D151+D150+D152)","v":52},{"$f":"(D151+D150+D152)-F152","v":0},null,null,null,152]
[null,53,"Breakfast",{"$f":"ROUND(B153*0.25,0)","v":13},null,null,null,null,null,null,153]
[null,{"$f":"B153","v":53},"Lunch",{"$f":"ROUND(B153*0.3,0)","v":16},null,null,null,null,null,null,154]
[null,{"$f":"B153","v":53},"Dinner",{"$f":"ROUND(B153*0.45,0)","v":24},null,{"$f":"(D154+D153+D155)","v":53},{"$f":"(D154+D153+D155)-F155","v":0},null,null,null,155]
[null,54,"Breakfast",{"$f":"ROUND(B156*0.25,0)","v":14},null,null,null,null,null,null,156]
[null,{"$f":"B156","v":54},"Lunch",{"$f":"ROUND(B156*0.3,0)","v":16},null,null,null,null,null,null,157]
[null,{"$f":"B156","v":54},"Dinner",{"$f":"ROUND(B156*0.45,0)","v":24},null,{"$f":"(D157+D156+D158)","v":54},{"$f":"(D157+D156+D158)-F158","v":0},null,null,null,158]
[null,55,"Breakfast",{"$f":"ROUND(B159*0.25,0)","v":14},null,null,null,null,null,null,159]
[null,{"$f":"B159","v":55},"Lunch",{"$f":"ROUND(B159*0.3,0)","v":17},null,null,null,null,null,null,160]
[null,{"$f":"B159","v":55},"Dinner",{"$f":"ROUND(B159*0.45,0)","v":25},null,{"$f":"(D160+D159+D161)","v":56},{"$f":"(D160+D159+D161)-F161","v":0},null,null,null,161]
[null,56,"Breakfast",{"$f":"ROUND(B162*0.25,0)","v":14},null,null,null,null,null,null,162]
[null,{"$f":"B162","v":56},"Lunch",{"$f":"ROUND(B162*0.3,0)","v":17},null,null,null,null,null,null,163]
[null,{"$f":"B162","v":56},"Dinner",{"$f":"ROUND(B162*0.45,0)","v":25},null,{"$f":"(D163+D162+D164)","v":56},{"$f":"(D163+D162+D164)-F164","v":0},null,null,null,164]
[null,57,"Breakfast",{"$f":"ROUND(B165*0.25,0)","v":14},null,null,null,null,null,null,165]
[null,{"$f":"B165","v":57},"Lunch",{"$f":"ROUND(B165*0.3,0)","v":17},null,null,null,null,null,null,166]
[null,{"$f":"B165","v":57},"Dinner",{"$f":"ROUND(B165*0.45,0)","v":26},null,{"$f":"(D166+D165+D167)","v":57},{"$f":"(D166+D165+D167)-F167","v":0},null,null,null,167]
[null,58,"Breakfast",{"$f":"ROUND(B168*0.25,0)","v":15},null,null,null,null,null,null,168]
[null,{"$f":"B168","v":58},"Lunch",{"$f":"ROUND(B168*0.3,0)","v":17},null,null,null,null,null,null,169]
[null,{"$f":"B168","v":58},"Dinner",{"$f":"ROUND(B168*0.45,0)","v":26},null,{"$f":"(D169+D168+D170)","v":58},{"$f":"(D169+D168+D170)-F170","v":0},null,null,null,170]
[null,59,"Breakfast",{"$f":"ROUND(B171*0.25,0)","v":15},null,null,null,null,null,null,171]
[null,{"$f":"B171","v":59},"Lunch",{"$f":"ROUND(B171*0.3,0)","v":18},null,null,null,null,null,null,172]
[null,{"$f":"B171","v":59},"Dinner",{"$f":"ROUND(B171*0.45,0)","v":27},null,{"$f":"(D172+D171+D173)","v":60},{"$f":"(D172+D171+D173)-F173","v":0},null,null,null,173]
[null,60,"Breakfast",{"$f":"ROUND(B174*0.25,0)","v":15},null,null,null,null,null,null,174]
[null,{"$f":"B174","v":60},"Lunch",{"$f":"ROUND(B174*0.3,0)","v":18},null,null,null,null,null,null,175]
[null,{"$f":"B174","v":60},"Dinner",{"$f":"ROUND(B174*0.45,0)","v":27},null,{"$f":"(D175+D174+D176)","v":60},{"$f":"(D175+D174+D176)-F176","v":0},null,null,null,176]
[null,61,"Breakfast",{"$f":"ROUND(B177*0.25,0)","v":15},null,null,null,null,null,null,177]
[null,{"$f":"B177","v":61},"Lunch",{"$f":"ROUND(B177*0.3,0)","v":18},null,null,null,null,null,null,178]
[null,{"$f":"B177","v":61},"Dinner",{"$f":"ROUND(B177*0.45,0)","v":27},null,{"$f":"(D178+D177+D179)","v":60},{"$f":"(D178+D177+D179)-F179","v":0},null,null,null,179]
[null,62,"Breakfast",{"$f":"ROUND(B180*0.25,0)","v":16},null,null,null,null,null,null,180]
[null,{"$f":"B180","v":62},"Lunch",{"$f":"ROUND(B180*0.3,0)","v":19},null,null,null,null,null,null,181]
[null,{"$f":"B180","v":62},"Dinner",{"$f":"ROUND(B180*0.45,0)","v":28},null,{"$f":"(D181+D180+D182)","v":63},{"$f":"(D181+D180+D182)-F182","v":0},null,null,null,182]
[null,63,"Breakfast",{"$f":"ROUND(B183*0.25,0)","v":16},null,null,null,null,null,null,183]
[null,{"$f":"B183","v":63},"Lunch",{"$f":"ROUND(B183*0.3,0)","v":19},null,null,null,null,null,null,184]
[null,{"$f":"B183","v":63},"Dinner",{"$f":"ROUND(B183*0.45,0)","v":28},null,{"$f":"(D184+D183+D185)","v":63},{"$f":"(D184+D183+D185)-F185","v":0},null,null,null,185]
[null,64,"Breakfast",{"$f":"ROUND(B186*0.25,0)","v":16},null,null,null,null,null,null,186]
[null,{"$f":"B186","v":64},"Lunch",{"$f":"ROUND(B186*0.3,0)","v":19},null,null,null,null,null,null,187]
[null,{"$f":"B186","v":64},"Dinner",{"$f":"ROUND(B186*0.45,0)","v":29},null,{"$f":"(D187+D186+D188)","v":64},{"$f":"(D187+D186+D188)-F188","v":0},null,null,null,188]
[null,65,"Breakfast",{"$f":"ROUND(B189*0.25,0)","v":16},null,null,null,null,null,null,189]
[null,{"$f":"B189","v":65},"Lunch",{"$f":"ROUND(B189*0.3,0)","v":20},null,null,null,null,null,null,190]
[null,{"$f":"B189","v":65},"Dinner",{"$f":"ROUND(B189*0.45,0)","v":29},null,{"$f":"(D190+D189+D191)","v":65},{"$f":"(D190+D189+D191)-F191","v":0},null,null,null,191]
[null,66,"Breakfast",{"$f":"ROUND(B192*0.25,0)","v":17},null,null,null,null,null,null,192]
[null,{"$f":"B192","v":66},"Lunch",{"$f":"ROUND(B192*0.3,0)","v":20},null,null,null,null,null,null,193]
[null,{"$f":"B192","v":66},"Dinner",{"$f":"ROUND(B192*0.45,0)","v":30},null,{"$f":"(D193+D192+D194)","v":67},{"$f":"(D193+D192+D194)-F194","v":0},null,null,null,194]
[null,67,"Breakfast",{"$f":"ROUND(B195*0.25,0)","v":17},null,null,null,null,null,null,195]
[null,{"$f":"B195","v":67},"Lunch",{"$f":"ROUND(B195*0.3,0)","v":20},null,null,null,null,null,null,196]
[null,{"$f":"B195","v":67},"Dinner",{"$f":"ROUND(B195*0.45,0)","v":30},null,{"$f":"(D196+D195+D197)","v":67},{"$f":"(D196+D195+D197)-F197","v":0},null,null,null,197]
[null,68,"Breakfast",{"$f":"ROUND(B198*0.25,0)","v":17},null,null,null,null,null,null,198]
[null,{"$f":"B198","v":68},"Lunch",{"$f":"ROUND(B198*0.3,0)","v":20},null,null,null,null,null,null,199]
[null,{"$f":"B198","v":68},"Dinner",{"$f":"ROUND(B198*0.45,0)","v":31},null,{"$f":"(D199+D198+D200)","v":68},{"$f":"(D199+D198+D200)-F200","v":0},null,null,null,200]
[null,69,"Breakfast",{"$f":"ROUND(B201*0.25,0)","v":17},null,null,null,null,null,null,201]
[null,{"$f":"B201","v":69},"Lunch",{"$f":"ROUND(B201*0.3,0)","v":21},null,null,null,null,null,null,202]
[null,{"$f":"B201","v":69},"Dinner",{"$f":"ROUND(B201*0.45,0)","v":31},null,{"$f":"(D202+D201+D203)","v":69},{"$f":"(D202+D201+D203)-F203","v":0},null,null,null,203]
[null,70,"Breakfast",{"$f":"ROUND(B204*0.25,0)","v":18},null,null,null,null,null,null,204]
[null,{"$f":"B204","v":70},"Lunch",{"$f":"ROUND(B204*0.3,0)","v":21},null,null,null,null,null,null,205]
[null,{"$f":"B204","v":70},"Dinner",{"$f":"ROUND(B204*0.45,0)","v":32},null,{"$f":"(D205+D204+D206)","v":71},{"$f":"(D205+D204+D206)-F206","v":0},null,null,null,206]
[null,71,"Breakfast",{"$f":"ROUND(B207*0.25,0)","v":18},null,null,null,null,null,null,207]
[null,{"$f":"B207","v":71},"Lunch",{"$f":"ROUND(B207*0.3,0)","v":21},null,null,null,null,null,null,208]
[null,{"$f":"B207","v":71},"Dinner",{"$f":"ROUND(B207*0.45,0)","v":32},null,{"$f":"(D208+D207+D209)","v":71},{"$f":"(D208+D207+D209)-F209","v":0},null,null,null,209]
[null,72,"Breakfast",{"$f":"ROUND(B210*0.25,0)","v":18},null,null,null,null,null,null,210]
[null,{"$f":"B210","v":72},"Lunch",{"$f":"ROUND(B210*0.3,0)","v":22},null,null,null,null,null,null,211]
[null,{"$f":"B210","v":72},"Dinner",{"$f":"ROUND(B210*0.45,0)","v":32},null,{"$f":"(D211+D210+D212)","v":72},{"$f":"(D211+D210+D212)-F212","v":0},null,null,null,212]
[null,73,"Breakfast",{"$f":"ROUND(B213*0.25,0)","v":18},null,null,null,null,null,null,213]
[null,{"$f":"B213","v":73},"Lunch",{"$f":"ROUND(B213*0.3,0)","v":22},null,null,null,null,null,null,214]
[null,{"$f":"B213","v":73},"Dinner",{"$f":"ROUND(B213*0.45,0)","v":33},null,{"$f":"(D214+D213+D215)","v":73},{"$f":"(D214+D213+D215)-F215","v":0},null,null,null,215]
[null,74,"Breakfast",{"$f":"ROUND(B216*0.25,0)","v":19},null,null,null,null,null,null,216]
[null,{"$f":"B216","v":74},"Lunch",{"$f":"ROUND(B216*0.3,0)","v":22},null,null,null,null,null,null,217]
[null,{"$f":"B216","v":74},"Dinner",{"$f":"ROUND(B216*0.45,0)","v":33},null,{"$f":"(D217+D216+D218)","v":74},{"$f":"(D217+D216+D218)-F218","v":0},null,null,null,218]
[null,75,"Breakfast",{"$f":"ROUND(B219*0.25,0)","v":19},null,null,null,null,null,null,219]
[null,{"$f":"B219","v":75},"Lunch",{"$f":"ROUND(B219*0.3,0)","v":23},null,null,null,null,null,null,220]
[null,{"$f":"B219","v":75},"Dinner",{"$f":"ROUND(B219*0.45,0)","v":34},null,{"$f":"(D220+D219+D221)","v":76},{"$f":"(D220+D219+D221)-F221","v":0},null,null,null,221]
[null,76,"Breakfast",{"$f":"ROUND(B222*0.25,0)","v":19},null,null,null,null,null,null,222]
[null,{"$f":"B222","v":76},"Lunch",{"$f":"ROUND(B222*0.3,0)","v":23},null,null,null,null,null,null,223]
[null,{"$f":"B222","v":76},"Dinner",{"$f":"ROUND(B222*0.45,0)","v":34},null,{"$f":"(D223+D222+D224)","v":76},{"$f":"(D223+D222+D224)-F224","v":0},null,null,null,224]
[null,77,"Breakfast",{"$f":"ROUND(B225*0.25,0)","v":19},null,null,null,null,null,null,225]
[null,{"$f":"B225","v":77},"Lunch",{"$f":"ROUND(B225*0.3,0)","v":23},null,null,null,null,null,null,226]
[null,{"$f":"B225","v":77},"Dinner",{"$f":"ROUND(B225*0.45,0)","v":35},null,{"$f":"(D226+D225+D227)","v":77},{"$f":"(D226+D225+D227)-F227","v":0},null,null,null,227]
[null,78,"Breakfast",{"$f":"ROUND(B228*0.25,0)","v":20},null,null,null,null,null,null,228]
[null,{"$f":"B228","v":78},"Lunch",{"$f":"ROUND(B228*0.3,0)","v":23},null,null,null,null,null,null,229]
[null,{"$f":"B228","v":78},"Dinner",{"$f":"ROUND(B228*0.45,0)","v":35},null,{"$f":"(D229+D228+D230)","v":78},{"$f":"(D229+D228+D230)-F230","v":0},null,null,null,230]
[null,79,"Breakfast",{"$f":"ROUND(B231*0.25,0)","v":20},null,null,null,null,null,null,231]
[null,{"$f":"B231","v":79},"Lunch",{"$f":"ROUND(B231*0.3,0)","v":24},null,null,null,null,null,null,232]
[null,{"$f":"B231","v":79},"Dinner",{"$f":"ROUND(B231*0.45,0)","v":36},null,{"$f":"(D232+D231+D233)","v":80},{"$f":"(D232+D231+D233)-F233","v":0},null,null,null,233]
[null,80,"Breakfast",{"$f":"ROUND(B234*0.25,0)","v":20},null,null,null,null,null,null,234]
[null,{"$f":"B234","v":80},"Lunch",{"$f":"ROUND(B234*0.3,0)","v":24},null,null,null,null,null,null,235]
[null,{"$f":"B234","v":80},"Dinner",{"$f":"ROUND(B234*0.45,0)","v":36},null,{"$f":"(D235+D234+D236)","v":80},{"$f":"(D235+D234+D236)-F236","v":0},null,null,null,236]
[null,81,"Breakfast",{"$f":"ROUND(B237*0.25,0)","v":20},null,null,null,null,null,null,237]
[null,{"$f":"B237","v":81},"Lunch",{"$f":"ROUND(B237*0.3,0)","v":24},null,null,null,null,null,null,238]
[null,{"$f":"B237","v":81},"Dinner",{"$f":"ROUND(B237*0.45,0)","v":36},null,{"$f":"(D238+D237+D239)","v":80},{"$f":"(D238+D237+D239)-F239","v":0},null,null,null,239]
[null,82,"Breakfast",{"$f":"ROUND(B240*0.25,0)","v":21},null,null,null,null,null,null,240]
[null,{"$f":"B240","v":82},"Lunch",{"$f":"ROUND(B240*0.3,0)","v":25},null,null,null,null,null,null,241]
[null,{"$f":"B240","v":82},"Dinner",{"$f":"ROUND(B240*0.45,0)","v":37},null,{"$f":"(D241+D240+D242)","v":83},{"$f":"(D241+D240+D242)-F242","v":0},null,null,null,242]
[null,83,"Breakfast",{"$f":"ROUND(B243*0.25,0)","v":21},null,null,null,null,null,null,243]
[null,{"$f":"B243","v":83},"Lunch",{"$f":"ROUND(B243*0.3,0)","v":25},null,null,null,null,null,null,244]
[null,{"$f":"B243","v":83},"Dinner",{"$f":"ROUND(B243*0.45,0)","v":37},null,{"$f":"(D244+D243+D245)","v":83},{"$f":"(D244+D243+D245)-F245","v":0},null,null,null,245]
[null,84,"Breakfast",{"$f":"ROUND(B246*0.25,0)","v":21},null,null,null,null,null,null,246]
[null,{"$f":"B246","v":84},"Lunch",{"$f":"ROUND(B246*0.3,0)","v":25},null,null,null,null,null,null,247]
[null,{"$f":"B246","v":84},"Dinner",{"$f":"ROUND(B246*0.45,0)","v":38},null,{"$f":"(D247+D246+D248)","v":84},{"$f":"(D247+D246+D248)-F248","v":0},null,null,null,248]
[null,85,"Breakfast",{"$f":"ROUND(B249*0.25,0)","v":21},null,null,null,null,null,null,249]
[null,{"$f":"B249","v":85},"Lunch",{"$f":"ROUND(B249*0.3,0)","v":26},null,null,null,null,null,null,250]
[null,{"$f":"B249","v":85},"Dinner",{"$f":"ROUND(B249*0.45,0)","v":38},null,{"$f":"(D250+D249+D251)","v":85},{"$f":"(D250+D249+D251)-F251","v":0},null,null,null,251]
[null,86,"Breakfast",{"$f":"ROUND(B252*0.25,0)","v":22},null,null,null,null,null,null,252]
[null,{"$f":"B252","v":86},"Lunch",{"$f":"ROUND(B252*0.3,0)","v":26},null,null,null,null,null,null,253]
[null,{"$f":"B252","v":86},"Dinner",{"$f":"ROUND(B252*0.45,0)","v":39},null,{"$f":"(D253+D252+D254)","v":87},{"$f":"(D253+D252+D254)-F254","v":0},null,null,null,254]
[null,87,"Breakfast",{"$f":"ROUND(B255*0.25,0)","v":22},null,null,null,null,null,null,255]
[null,{"$f":"B255","v":87},"Lunch",{"$f":"ROUND(B255*0.3,0)","v":26},null,null,null,null,null,null,256]
[null,{"$f":"B255","v":87},"Dinner",{"$f":"ROUND(B255*0.45,0)","v":39},null,{"$f":"(D256+D255+D257)","v":87},{"$f":"(D256+D255+D257)-F257","v":0},null,null,null,257]
[null,88,"Breakfast",{"$f":"ROUND(B258*0.25,0)","v":22},null,null,null,null,null,null,258]
[null,{"$f":"B258","v":88},"Lunch",{"$f":"ROUND(B258*0.3,0)","v":26},null,null,null,null,null,null,259]
[null,{"$f":"B258","v":88},"Dinner",{"$f":"ROUND(B258*0.45,0)","v":40},null,{"$f":"(D259+D258+D260)","v":88},{"$f":"(D259+D258+D260)-F260","v":0},null,null,null,260]
[null,89,"Breakfast",{"$f":"ROUND(B261*0.25,0)","v":22},null,null,null,null,null,null,261]
[null,{"$f":"B261","v":89},"Lunch",{"$f":"ROUND(B261*0.3,0)","v":27},null,null,null,null,null,null,262]
[null,{"$f":"B261","v":89},"Dinner",{"$f":"ROUND(B261*0.45,0)","v":40},null,{"$f":"(D262+D261+D263)","v":89},{"$f":"(D262+D261+D263)-F263","v":0},null,null,null,263]
[null,90,"Breakfast",{"$f":"ROUND(B264*0.25,0)","v":23},null,null,null,null,null,null,264]
[null,{"$f":"B264","v":90},"Lunch",{"$f":"ROUND(B264*0.3,0)","v":27},null,null,null,null,null,null,265]
[null,{"$f":"B264","v":90},"Dinner",{"$f":"ROUND(B264*0.45,0)","v":41},null,{"$f":"(D265+D264+D266)","v":91},{"$f":"(D265+D264+D266)-F266","v":0},null,null,null,266]
[null,91,"Breakfast",{"$f":"ROUND(B267*0.25,0)","v":23},null,null,null,null,null,null,267]
[null,{"$f":"B267","v":91},"Lunch",{"$f":"ROUND(B267*0.3,0)","v":27},null,null,null,null,null,null,268]
[null,{"$f":"B267","v":91},"Dinner",{"$f":"ROUND(B267*0.45,0)","v":41},null,{"$f":"(D268+D267+D269)","v":91},{"$f":"(D268+D267+D269)-F269","v":0},null,null,null,269]
[null,92,"Breakfast",{"$f":"ROUND(B270*0.25,0)","v":23},null,null,null,null,null,null,270]
[null,{"$f":"B270","v":92},"Lunch",{"$f":"ROUND(B270*0.3,0)","v":28},null,null,null,null,null,null,271]
[null,{"$f":"B270","v":92},"Dinner",{"$f":"ROUND(B270*0.45,0)","v":41},null,{"$f":"(D271+D270+D272)","v":92},{"$f":"(D271+D270+D272)-F272","v":0},null,null,null,272]
[null,93,"Breakfast",{"$f":"ROUND(B273*0.25,0)","v":23},null,null,null,null,null,null,273]
[null,{"$f":"B273","v":93},"Lunch",{"$f":"ROUND(B273*0.3,0)","v":28},null,null,null,null,null,null,274]
[null,{"$f":"B273","v":93},"Dinner",{"$f":"ROUND(B273*0.45,0)","v":42},null,{"$f":"(D274+D273+D275)","v":93},{"$f":"(D274+D273+D275)-F275","v":0},null,null,null,275]
[null,94,"Breakfast",{"$f":"ROUND(B276*0.25,0)","v":24},null,null,null,null,null,null,276]
[null,{"$f":"B276","v":94},"Lunch",{"$f":"ROUND(B276*0.3,0)","v":28},null,null,null,null,null,null,277]
[null,{"$f":"B276","v":94},"Dinner",{"$f":"ROUND(B276*0.45,0)","v":42},null,{"$f":"(D277+D276+D278)","v":94},{"$f":"(D277+D276+D278)-F278","v":0},null,null,null,278]
[null,95,"Breakfast",{"$f":"ROUND(B279*0.25,0)","v":24},null,null,null,null,null,null,279]
[null,{"$f":"B279","v":95},"Lunch",{"$f":"ROUND(B279*0.3,0)","v":29},null,null,null,null,null,null,280]
[null,{"$f":"B279","v":95},"Dinner",{"$f":"ROUND(B279*0.45,0)","v":43},null,{"$f":"(D280+D279+D281)","v":96},{"$f":"(D280+D279+D281)-F281","v":0},null,null,null,281]
[null,96,"Breakfast",{"$f":"ROUND(B282*0.25,0)","v":24},null,null,null,null,null,null,282]
[null,{"$f":"B282","v":96},"Lunch",{"$f":"ROUND(B282*0.3,0)","v":29},null,null,null,null,null,null,283]
[null,{"$f":"B282","v":96},"Dinner",{"$f":"ROUND(B282*0.45,0)","v":43},null,{"$f":"(D283+D282+D284)","v":96},{"$f":"(D283+D282+D284)-F284","v":0},null,null,null,284]
[null,97,"Breakfast",{"$f":"ROUND(B285*0.25,0)","v":24},null,null,null,null,null,null,285]
[null,{"$f":"B285","v":97},"Lunch",{"$f":"ROUND(B285*0.3,0)","v":29},null,null,null,null,null,null,286]
[null,{"$f":"B285","v":97},"Dinner",{"$f":"ROUND(B285*0.45,0)","v":44},null,{"$f":"(D286+D285+D287)","v":97},{"$f":"(D286+D285+D287)-F287","v":0},null,null,null,287]
[null,98,"Breakfast",{"$f":"ROUND(B288*0.25,0)","v":25},null,null,null,null,null,null,288]
[null,{"$f":"B288","v":98},"Lunch",{"$f":"ROUND(B288*0.3,0)","v":29},null,null,null,null,null,null,289]
[null,{"$f":"B288","v":98},"Dinner",{"$f":"ROUND(B288*0.45,0)","v":44},null,{"$f":"(D289+D288+D290)","v":98},{"$f":"(D289+D288+D290)-F290","v":0},null,null,null,290]
[null,99,"Breakfast",{"$f":"ROUND(B291*0.25,0)","v":25},null,null,null,null,null,null,291]
[null,{"$f":"B291","v":99},"Lunch",{"$f":"ROUND(B291*0.3,0)","v":30},null,null,null,null,null,null,292]
[null,{"$f":"B291","v":99},"Dinner",{"$f":"ROUND(B291*0.45,0)","v":45},null,{"$f":"(D292+D291+D293)","v":100},{"$f":"(D292+D291+D293)-F293","v":0},null,null,null,293]
[null,100,"Breakfast",{"$f":"ROUND(B294*0.25,0)","v":25},null,null,null,null,null,null,294]
[null,{"$f":"B294","v":100},"Lunch",{"$f":"ROUND(B294*0.3,0)","v":30},null,null,null,null,null,null,295]
[null,{"$f":"B294","v":100},"Dinner",{"$f":"ROUND(B294*0.45,0)","v":45},null,{"$f":"(D295+D294+D296)","v":100},{"$f":"(D295+D294+D296)-F296","v":0},null,null,null,296]
[null,101,"Breakfast",{"$f":"ROUND(B297*0.25,0)","v":25},null,null,null,null,null,null,297]
[null,{"$f":"B297","v":101},"Lunch",{"$f":"ROUND(B297*0.3,0)","v":30},null,null,null,null,null,null,298]
[null,{"$f":"B297","v":101},"Dinner",{"$f":"ROUND(B297*0.45,0)","v":45},null,{"$f":"(D298+D297+D299)","v":100},{"$f":"(D298+D297+D299)-F299","v":0},null,null,null,299]
[null,102,"Breakfast",{"$f":"ROUND(B300*0.25,0)","v":26},null,null,null,null,null,null,300]
[null,{"$f":"B300","v":102},"Lunch",{"$f":"ROUND(B300*0.3,0)","v":31},null,null,null,null,null,null,301]
[null,{"$f":"B300","v":102},"Dinner",{"$f":"ROUND(B300*0.45,0)","v":46},null,{"$f":"(D301+D300+D302)","v":103},{"$f":"(D301+D300+D302)-F302","v":0},null,null,null,302]
[null,103,"Breakfast",{"$f":"ROUND(B303*0.25,0)","v":26},null,null,null,null,null,null,303]
[null,{"$f":"B303","v":103},"Lunch",{"$f":"ROUND(B303*0.3,0)","v":31},null,null,null,null,null,null,304]
[null,{"$f":"B303","v":103},"Dinner",{"$f":"ROUND(B303*0.45,0)","v":46},null,{"$f":"(D304+D303+D305)","v":103},{"$f":"(D304+D303+D305)-F305","v":0},null,null,null,305]
[null,104,"Breakfast",{"$f":"ROUND(B306*0.25,0)","v":26},null,null,null,null,null,null,306]
[null,{"$f":"B306","v":104},"Lunch",{"$f":"ROUND(B306*0.3,0)","v":31},null,null,null,null,null,null,307]
[null,{"$f":"B306","v":104},"Dinner",{"$f":"ROUND(B306*0.45,0)","v":47},null,{"$f":"(D307+D306+D308)","v":104},{"$f":"(D307+D306+D308)-F308","v":0},null,null,null,308]
[null,105,"Breakfast",{"$f":"ROUND(B309*0.25,0)","v":26},null,null,null,null,null,null,309]
[null,{"$f":"B309","v":105},"Lunch",{"$f":"ROUND(B309*0.3,0)","v":32},null,null,null,null,null,null,310]
[null,{"$f":"B309","v":105},"Dinner",{"$f":"ROUND(B309*0.45,0)","v":47},null,{"$f":"(D310+D309+D311)","v":105},{"$f":"(D310+D309+D311)-F311","v":0},null,null,null,311]
[null,106,"Breakfast",{"$f":"ROUND(B312*0.25,0)","v":27},null,null,null,null,null,null,312]
[null,{"$f":"B312","v":106},"Lunch",{"$f":"ROUND(B312*0.3,0)","v":32},null,null,null,null,null,null,313]
[null,{"$f":"B312","v":106},"Dinner",{"$f":"ROUND(B312*0.45,0)","v":48},null,{"$f":"(D313+D312+D314)","v":107},{"$f":"(D313+D312+D314)-F314","v":0},null,null,null,314]
[null,107,"Breakfast",{"$f":"ROUND(B315*0.25,0)","v":27},null,null,null,null,null,null,315]
[null,{"$f":"B315","v":107},"Lunch",{"$f":"ROUND(B315*0.3,0)","v":32},null,null,null,null,null,null,316]
[null,{"$f":"B315","v":107},"Dinner",{"$f":"ROUND(B315*0.45,0)","v":48},null,{"$f":"(D316+D315+D317)","v":107},{"$f":"(D316+D315+D317)-F317","v":0},null,null,null,317]
[null,108,"Breakfast",{"$f":"ROUND(B318*0.25,0)","v":27},null,null,null,null,null,null,318]
[null,{"$f":"B318","v":108},"Lunch",{"$f":"ROUND(B318*0.3,0)","v":32},null,null,null,null,null,null,319]
[null,{"$f":"B318","v":108},"Dinner",{"$f":"ROUND(B318*0.45,0)","v":49},null,{"$f":"(D319+D318+D320)","v":108},{"$f":"(D319+D318+D320)-F320","v":0},null,null,null,320]
[null,109,"Breakfast",{"$f":"ROUND(B321*0.25,0)","v":27},null,null,null,null,null,null,321]
[null,{"$f":"B321","v":109},"Lunch",{"$f":"ROUND(B321*0.3,0)","v":33},null,null,null,null,null,null,322]
[null,{"$f":"B321","v":109},"Dinner",{"$f":"ROUND(B321*0.45,0)","v":49},null,{"$f":"(D322+D321+D323)","v":109},{"$f":"(D322+D321+D323)-F323","v":0},null,null,null,323]
[null,110,"Breakfast",{"$f":"ROUND(B324*0.25,0)","v":28},null,null,null,null,null,null,324]
[null,{"$f":"B324","v":110},"Lunch",{"$f":"ROUND(B324*0.3,0)","v":33},null,null,null,null,null,null,325]
[null,{"$f":"B324","v":110},"Dinner",{"$f":"ROUND(B324*0.45,0)","v":50},null,{"$f":"(D325+D324+D326)","v":111},{"$f":"(D325+D324+D326)-F326","v":0},null,null,null,326]
[null,111,"Breakfast",{"$f":"ROUND(B327*0.25,0)","v":28},null,null,null,null,null,null,327]
[null,{"$f":"B327","v":111},"Lunch",{"$f":"ROUND(B327*0.3,0)","v":33},null,null,null,null,null,null,328]
[null,{"$f":"B327","v":111},"Dinner",{"$f":"ROUND(B327*0.45,0)","v":50},null,{"$f":"(D328+D327+D329)","v":111},{"$f":"(D328+D327+D329)-F329","v":0},null,null,null,329]
[null,112,"Breakfast",{"$f":"ROUND(B330*0.25,0)","v":28},null,null,null,null,null,null,330]
[null,{"$f":"B330","v":112},"Lunch",{"$f":"ROUND(B330*0.3,0)","v":34},null,null,null,null,null,null,331]
[null,{"$f":"B330","v":112},"Dinner",{"$f":"ROUND(B330*0.45,0)","v":50},null,{"$f":"(D331+D330+D332)","v":112},{"$f":"(D331+D330+D332)-F332","v":0},null,null,null,332]
[null,113,"Breakfast",{"$f":"ROUND(B333*0.25,0)","v":28},null,null,null,null,null,null,333]
[null,{"$f":"B333","v":113},"Lunch",{"$f":"ROUND(B333*0.3,0)","v":34},null,null,null,null,null,null,334]
[null,{"$f":"B333","v":113},"Dinner",{"$f":"ROUND(B333*0.45,0)","v":51},null,{"$f":"(D334+D333+D335)","v":113},{"$f":"(D334+D333+D335)-F335","v":0},null,null,null,335]
[null,114,"Breakfast",{"$f":"ROUND(B336*0.25,0)","v":29},null,null,null,null,null,null,336]
[null,{"$f":"B336","v":114},"Lunch",{"$f":"ROUND(B336*0.3,0)","v":34},null,null,null,null,null,null,337]
[null,{"$f":"B336","v":114},"Dinner",{"$f":"ROUND(B336*0.45,0)","v":51},null,{"$f":"(D337+D336+D338)","v":114},{"$f":"(D337+D336+D338)-F338","v":0},null,null,null,338]
[null,115,"Breakfast",{"$f":"ROUND(B339*0.25,0)","v":29},null,null,null,null,null,null,339]
[null,{"$f":"B339","v":115},"Lunch",{"$f":"ROUND(B339*0.3,0)","v":35},null,null,null,null,null,null,340]
[null,{"$f":"B339","v":115},"Dinner",{"$f":"ROUND(B339*0.45,0)","v":52},null,{"$f":"(D340+D339+D341)","v":116},{"$f":"(D340+D339+D341)-F341","v":0},null,null,null,341]
[null,116,"Breakfast",{"$f":"ROUND(B342*0.25,0)","v":29},null,null,null,null,null,null,342]
[null,{"$f":"B342","v":116},"Lunch",{"$f":"ROUND(B342*0.3,0)","v":35},null,null,null,null,null,null,343]
[null,{"$f":"B342","v":116},"Dinner",{"$f":"ROUND(B342*0.45,0)","v":52},null,{"$f":"(D343+D342+D344)","v":116},{"$f":"(D343+D342+D344)-F344","v":0},null,null,null,344]
[null,117,"Breakfast",{"$f":"ROUND(B345*0.25,0)","v":29},null,null,null,null,null,null,345]
[null,{"$f":"B345","v":117},"Lunch",{"$f":"ROUND(B345*0.3,0)","v":35},null,null,null,null,null,null,346]
[null,{"$f":"B345","v":117},"Dinner",{"$f":"ROUND(B345*0.45,0)","v":53},null,{"$f":"(D346+D345+D347)","v":117},{"$f":"(D346+D345+D347)-F347","v":0},null,null,null,347]
[null,118,"Breakfast",{"$f":"ROUND(B348*0.25,0)","v":30},null,null,null,null,null,null,348]
[null,{"$f":"B348","v":118},"Lunch",{"$f":"ROUND(B348*0.3,0)","v":35},null,null,null,null,null,null,349]
[null,{"$f":"B348","v":118},"Dinner",{"$f":"ROUND(B348*0.45,0)","v":53},null,{"$f":"(D349+D348+D350)","v":118},{"$f":"(D349+D348+D350)-F350","v":0},null,null,null,350]
[null,119,"Breakfast",{"$f":"ROUND(B351*0.25,0)","v":30},null,null,null,null,null,null,351]
[null,{"$f":"B351","v":119},"Lunch",{"$f":"ROUND(B351*0.3,0)","v":36},null,null,null,null,null,null,352]
[null,{"$f":"B351","v":119},"Dinner",{"$f":"ROUND(B351*0.45,0)","v":54},null,{"$f":"(D352+D351+D353)","v":120},{"$f":"(D352+D351+D353)-F353","v":0},null,null,null,353]
[null,120,"Breakfast",{"$f":"ROUND(B354*0.25,0)","v":30},null,null,null,null,null,null,354]
[null,{"$f":"B354","v":120},"Lunch",{"$f":"ROUND(B354*0.3,0)","v":36},null,null,null,null,null,null,355]
[null,{"$f":"B354","v":120},"Dinner",{"$f":"ROUND(B354*0.45,0)","v":54},null,{"$f":"(D355+D354+D356)","v":120},{"$f":"(D355+D354+D356)-F356","v":0},null,null,null,356]
[null,121,"Breakfast",{"$f":"ROUND(B357*0.25,0)","v":30},null,null,null,null,null,null,357]
[null,{"$f":"B357","v":121},"Lunch",{"$f":"ROUND(B357*0.3,0)","v":36},null,null,null,null,null,null,358]
[null,{"$f":"B357","v":121},"Dinner",{"$f":"ROUND(B357*0.45,0)","v":54},null,{"$f":"(D358+D357+D359)","v":120},{"$f":"(D358+D357+D359)-F359","v":0},null,null,null,359]
[null,122,"Breakfast",{"$f":"ROUND(B360*0.25,0)","v":31},null,null,null,null,null,null,360]
[null,{"$f":"B360","v":122},"Lunch",{"$f":"ROUND(B360*0.3,0)","v":37},null,null,null,null,null,null,361]
[null,{"$f":"B360","v":122},"Dinner",{"$f":"ROUND(B360*0.45,0)","v":55},null,{"$f":"(D361+D360+D362)","v":123},{"$f":"(D361+D360+D362)-F362","v":0},null,null,null,362]
[null,123,"Breakfast",{"$f":"ROUND(B363*0.25,0)","v":31},null,null,null,null,null,null,363]
[null,{"$f":"B363","v":123},"Lunch",{"$f":"ROUND(B363*0.3,0)","v":37},null,null,null,null,null,null,364]
[null,{"$f":"B363","v":123},"Dinner",{"$f":"ROUND(B363*0.45,0)","v":55},null,{"$f":"(D364+D363+D365)","v":123},{"$f":"(D364+D363+D365)-F365","v":0},null,null,null,365]
[null,124,"Breakfast",{"$f":"ROUND(B366*0.25,0)","v":31},null,null,null,null,null,null,366]
[null,{"$f":"B366","v":124},"Lunch",{"$f":"ROUND(B366*0.3,0)","v":37},null,null,null,null,null,null,367]
[null,{"$f":"B366","v":124},"Dinner",{"$f":"ROUND(B366*0.45,0)","v":56},null,{"$f":"(D367+D366+D368)","v":124},{"$f":"(D367+D366+D368)-F368","v":0},null,null,null,368]
[null,125,"Breakfast",{"$f":"ROUND(B369*0.25,0)","v":31},null,null,null,null,null,null,369]
[null,{"$f":"B369","v":125},"Lunch",{"$f":"ROUND(B369*0.3,0)","v":38},null,null,null,null,null,null,370]
[null,{"$f":"B369","v":125},"Dinner",{"$f":"ROUND(B369*0.45,0)","v":56},null,{"$f":"(D370+D369+D371)","v":125},{"$f":"(D370+D369+D371)-F371","v":0},null,null,null,371]
[null,126,"Breakfast",{"$f":"ROUND(B372*0.25,0)","v":32},null,null,null,null,null,null,372]
[null,{"$f":"B372","v":126},"Lunch",{"$f":"ROUND(B372*0.3,0)","v":38},null,null,null,null,null,null,373]
[null,{"$f":"B372","v":126},"Dinner",{"$f":"ROUND(B372*0.45,0)","v":57},null,{"$f":"(D373+D372+D374)","v":127},{"$f":"(D373+D372+D374)-F374","v":0},null,null,null,374]
[null,127,"Breakfast",{"$f":"ROUND(B375*0.25,0)","v":32},null,null,null,null,null,null,375]
[null,{"$f":"B375","v":127},"Lunch",{"$f":"ROUND(B375*0.3,0)","v":38},null,null,null,null,null,null,376]
[null,{"$f":"B375","v":127},"Dinner",{"$f":"ROUND(B375*0.45,0)","v":57},null,{"$f":"(D376+D375+D377)","v":127},{"$f":"(D376+D375+D377)-F377","v":0},null,null,null,377]
[null,128,"Breakfast",{"$f":"ROUND(B378*0.25,0)","v":32},null,null,null,null,null,null,378]
[null,{"$f":"B378","v":128},"Lunch",{"$f":"ROUND(B378*0.3,0)","v":38},null,null,null,null,null,null,379]
[null,{"$f":"B378","v":128},"Dinner",{"$f":"ROUND(B378*0.45,0)","v":58},null,{"$f":"(D379+D378+D380)","v":128},{"$f":"(D379+D378+D380)-F380","v":0},null,null,null,380]
[null,129,"Breakfast",{"$f":"ROUND(B381*0.25,0)","v":32},null,null,null,null,null,null,381]
[null,{"$f":"B381","v":129},"Lunch",{"$f":"ROUND(B381*0.3,0)","v":39},null,null,null,null,null,null,382]
[null,{"$f":"B381","v":129},"Dinner",{"$f":"ROUND(B381*0.45,0)","v":58},null,{"$f":"(D382+D381+D383)","v":129},{"$f":"(D382+D381+D383)-F383","v":0},null,null,null,383]
[null,130,"Breakfast",{"$f":"ROUND(B384*0.25,0)","v":33},null,null,null,null,null,null,384]
[null,{"$f":"B384","v":130},"Lunch",{"$f":"ROUND(B384*0.3,0)","v":39},null,null,null,null,null,null,385]
[null,{"$f":"B384","v":130},"Dinner",{"$f":"ROUND(B384*0.45,0)","v":59},null,{"$f":"(D385+D384+D386)","v":131},{"$f":"(D385+D384+D386)-F386","v":0},null,null,null,386]
[null,131,"Breakfast",{"$f":"ROUND(B387*0.25,0)","v":33},null,null,null,null,null,null,387]
[null,{"$f":"B387","v":131},"Lunch",{"$f":"ROUND(B387*0.3,0)","v":39},null,null,null,null,null,null,388]
[null,{"$f":"B387","v":131},"Dinner",{"$f":"ROUND(B387*0.45,0)","v":59},null,{"$f":"(D388+D387+D389)","v":131},{"$f":"(D388+D387+D389)-F389","v":0},null,null,null,389]
[null,132,"Breakfast",{"$f":"ROUND(B390*0.25,0)","v":33},null,null,null,null,null,null,390]
[null,{"$f":"B390","v":132},"Lunch",{"$f":"ROUND(B390*0.3,0)","v":40},null,null,null,null,null,null,391]
[null,{"$f":"B390","v":132},"Dinner",{"$f":"ROUND(B390*0.45,0)","v":59},null,{"$f":"(D391+D390+D392)","v":132},{"$f":"(D391+D390+D392)-F392","v":0},null,null,null,392]
[null,133,"Breakfast",{"$f":"ROUND(B393*0.25,0)","v":33},null,null,null,null,null,null,393]
[null,{"$f":"B393","v":133},"Lunch",{"$f":"ROUND(B393*0.3,0)","v":40},null,null,null,null,null,null,394]
[null,{"$f":"B393","v":133},"Dinner",{"$f":"ROUND(B393*0.45,0)","v":60},null,{"$f":"(D394+D393+D395)","v":133},{"$f":"(D394+D393+D395)-F395","v":0},null,null,null,395]
[null,134,"Breakfast",{"$f":"ROUND(B396*0.25,0)","v":34},null,null,null,null,null,null,396]
[null,{"$f":"B396","v":134},"Lunch",{"$f":"ROUND(B396*0.3,0)","v":40},null,null,null,null,null,null,397]
[null,{"$f":"B396","v":134},"Dinner",{"$f":"ROUND(B396*0.45,0)","v":60},null,{"$f":"(D397+D396+D398)","v":134},{"$f":"(D397+D396+D398)-F398","v":0},null,null,null,398]
[null,135,"Breakfast",{"$f":"ROUND(B399*0.25,0)","v":34},null,null,null,null,null,null,399]
[null,{"$f":"B399","v":135},"Lunch",{"$f":"ROUND(B399*0.3,0)","v":41},null,null,null,null,null,null,400]
[null,{"$f":"B399","v":135},"Dinner",{"$f":"ROUND(B399*0.45,0)","v":61},null,{"$f":"(D400+D399+D401)","v":136},{"$f":"(D400+D399+D401)-F401","v":0},null,null,null,401]
[null,136,"Breakfast",{"$f":"ROUND(B402*0.25,0)","v":34},null,null,null,null,null,null,402]
[null,{"$f":"B402","v":136},"Lunch",{"$f":"ROUND(B402*0.3,0)","v":41},null,null,null,null,null,null,403]
[null,{"$f":"B402","v":136},"Dinner",{"$f":"ROUND(B402*0.45,0)","v":61},null,{"$f":"(D403+D402+D404)","v":136},{"$f":"(D403+D402+D404)-F404","v":0},null,null,null,404]
[null,137,"Breakfast",{"$f":"ROUND(B405*0.25,0)","v":34},null,null,null,null,null,null,405]
[null,{"$f":"B405","v":137},"Lunch",{"$f":"ROUND(B405*0.3,0)","v":41},null,null,null,null,null,null,406]
[null,{"$f":"B405","v":137},"Dinner",{"$f":"ROUND(B405*0.45,0)","v":62},null,{"$f":"(D406+D405+D407)","v":137},{"$f":"(D406+D405+D407)-F407","v":0},null,null,null,407]
[null,138,"Breakfast",{"$f":"ROUND(B408*0.25,0)","v":35},null,null,null,null,null,null,408]
[null,{"$f":"B408","v":138},"Lunch",{"$f":"ROUND(B408*0.3,0)","v":41},null,null,null,null,null,null,409]
[null,{"$f":"B408","v":138},"Dinner",{"$f":"ROUND(B408*0.45,0)","v":62},null,{"$f":"(D409+D408+D410)","v":138},{"$f":"(D409+D408+D410)-F410","v":0},null,null,null,410]
[null,139,"Breakfast",{"$f":"ROUND(B411*0.25,0)","v":35},null,null,null,null,null,null,411]
[null,{"$f":"B411","v":139},"Lunch",{"$f":"ROUND(B411*0.3,0)","v":42},null,null,null,null,null,null,412]
[null,{"$f":"B411","v":139},"Dinner",{"$f":"ROUND(B411*0.45,0)","v":63},null,{"$f":"(D412+D411+D413)","v":140},{"$f":"(D412+D411+D413)-F413","v":0},null,null,null,413]
[null,140,"Breakfast",{"$f":"ROUND(B414*0.25,0)","v":35},null,null,null,null,null,null,414]
[null,{"$f":"B414","v":140},"Lunch",{"$f":"ROUND(B414*0.3,0)","v":42},null,null,null,null,null,null,415]
[null,{"$f":"B414","v":140},"Dinner",{"$f":"ROUND(B414*0.45,0)","v":63},null,{"$f":"(D415+D414+D416)","v":140},{"$f":"(D415+D414+D416)-F416","v":0},null,null,null,416]
[null,141,"Breakfast",{"$f":"ROUND(B417*0.25,0)","v":35},null,null,null,null,null,null,417]
[null,{"$f":"B417","v":141},"Lunch",{"$f":"ROUND(B417*0.3,0)","v":42},null,null,null,null,null,null,418]
[null,{"$f":"B417","v":141},"Dinner",{"$f":"ROUND(B417*0.45,0)","v":63},null,{"$f":"(D418+D417+D419)","v":140},{"$f":"(D418+D417+D419)-F419","v":0},null,null,null,419]
[null,142,"Breakfast",{"$f":"ROUND(B420*0.25,0)","v":36},null,null,null,null,null,null,420]
[null,{"$f":"B420","v":142},"Lunch",{"$f":"ROUND(B420*0.3,0)","v":43},null,null,null,null,null,null,421]
[null,{"$f":"B420","v":142},"Dinner",{"$f":"ROUND(B420*0.45,0)","v":64},null,{"$f":"(D421+D420+D422)","v":143},{"$f":"(D421+D420+D422)-F422","v":0},null,null,null,422]
[null,143,"Breakfast",{"$f":"ROUND(B423*0.25,0)","v":36},null,null,null,null,null,null,423]
[null,{"$f":"B423","v":143},"Lunch",{"$f":"ROUND(B423*0.3,0)","v":43},null,null,null,null,null,null,424]
[null,{"$f":"B423","v":143},"Dinner",{"$f":"ROUND(B423*0.45,0)","v":64},null,{"$f":"(D424+D423+D425)","v":143},{"$f":"(D424+D423+D425)-F425","v":0},null,null,null,425]
[null,144,"Breakfast",{"$f":"ROUND(B426*0.25,0)","v":36},null,null,null,null,null,null,426]
[null,{"$f":"B426","v":144},"Lunch",{"$f":"ROUND(B426*0.3,0)","v":43},null,null,null,null,null,null,427]
[null,{"$f":"B426","v":144},"Dinner",{"$f":"ROUND(B426*0.45,0)","v":65},null,{"$f":"(D427+D426+D428)","v":144},{"$f":"(D427+D426+D428)-F428","v":0},null,null,null,428]
[null,145,"Breakfast",{"$f":"ROUND(B429*0.25,0)","v":36},null,null,null,null,null,null,429]
[null,{"$f":"B429","v":145},"Lunch",{"$f":"ROUND(B429*0.3,0)","v":44},null,null,null,null,null,null,430]
[null,{"$f":"B429","v":145},"Dinner",{"$f":"ROUND(B429*0.45,0)","v":65},null,{"$f":"(D430+D429+D431)","v":145},{"$f":"(D430+D429+D431)-F431","v":0},null,null,null,431]
[null,146,"Breakfast",{"$f":"ROUND(B432*0.25,0)","v":37},null,null,null,null,null,null,432]
[null,{"$f":"B432","v":146},"Lunch",{"$f":"ROUND(B432*0.3,0)","v":44},null,null,null,null,null,null,433]
[null,{"$f":"B432","v":146},"Dinner",{"$f":"ROUND(B432*0.45,0)","v":66},null,{"$f":"(D433+D432+D434)","v":147},{"$f":"(D433+D432+D434)-F434","v":0},null,null,null,434]
[null,147,"Breakfast",{"$f":"ROUND(B435*0.25,0)","v":37},null,null,null,null,null,null,435]
[null,{"$f":"B435","v":147},"Lunch",{"$f":"ROUND(B435*0.3,0)","v":44},null,null,null,null,null,null,436]
[null,{"$f":"B435","v":147},"Dinner",{"$f":"ROUND(B435*0.45,0)","v":66},null,{"$f":"(D436+D435+D437)","v":147},{"$f":"(D436+D435+D437)-F437","v":0},null,null,null,437]
[null,148,"Breakfast",{"$f":"ROUND(B438*0.25,0)","v":37},null,null,null,null,null,null,438]
[null,{"$f":"B438","v":148},"Lunch",{"$f":"ROUND(B438*0.3,0)","v":44},null,null,null,null,null,null,439]
[null,{"$f":"B438","v":148},"Dinner",{"$f":"ROUND(B438*0.45,0)","v":67},null,{"$f":"(D439+D438+D440)","v":148},{"$f":"(D439+D438+D440)-F440","v":0},null,null,null,440]
[null,149,"Breakfast",{"$f":"ROUND(B441*0.25,0)","v":37},null,null,null,null,null,null,441]
[null,{"$f":"B441","v":149},"Lunch",{"$f":"ROUND(B441*0.3,0)","v":45},null,null,null,null,null,null,442]
[null,{"$f":"B441","v":149},"Dinner",{"$f":"ROUND(B441*0.45,0)","v":67},null,{"$f":"(D442+D441+D443)","v":149},{"$f":"(D442+D441+D443)-F443","v":0},null,null,null,443]
[null,150,"Breakfast",{"$f":"ROUND(B444*0.25,0)","v":38},null,null,null,null,null,null,444]
[null,{"$f":"B444","v":150},"Lunch",{"$f":"ROUND(B444*0.3,0)","v":45},null,null,null,null,null,null,445]
[null,{"$f":"B444","v":150},"Dinner",{"$f":"ROUND(B444*0.45,0)","v":68},null,{"$f":"(D445+D444+D446)","v":151},{"$f":"(D445+D444+D446)-F446","v":0},null,null,null,446]
[null,151,"Breakfast",{"$f":"ROUND(B447*0.25,0)","v":38},null,null,null,null,null,null,447]
[null,{"$f":"B447","v":151},"Lunch",{"$f":"ROUND(B447*0.3,0)","v":45},null,null,null,null,null,null,448]
[null,{"$f":"B447","v":151},"Dinner",{"$f":"ROUND(B447*0.45,0)","v":68},null,{"$f":"(D448+D447+D449)","v":151},{"$f":"(D448+D447+D449)-F449","v":0},null,null,null,449]
[null,152,"Breakfast",{"$f":"ROUND(B450*0.25,0)","v":38},null,null,null,null,null,null,450]
[null,{"$f":"B450","v":152},"Lunch",{"$f":"ROUND(B450*0.3,0)","v":46},null,null,null,null,null,null,451]
[null,{"$f":"B450","v":152},"Dinner",{"$f":"ROUND(B450*0.45,0)","v":68},null,{"$f":"(D451+D450+D452)","v":152},{"$f":"(D451+D450+D452)-F452","v":0},null,null,null,452]
[null,153,"Breakfast",{"$f":"ROUND(B453*0.25,0)","v":38},null,null,null,null,null,null,453]
[null,{"$f":"B453","v":153},"Lunch",{"$f":"ROUND(B453*0.3,0)","v":46},null,null,null,null,null,null,454]
[null,{"$f":"B453","v":153},"Dinner",{"$f":"ROUND(B453*0.45,0)","v":69},null,{"$f":"(D454+D453+D455)","v":153},{"$f":"(D454+D453+D455)-F455","v":0},null,null,null,455]
[null,154,"Breakfast",{"$f":"ROUND(B456*0.25,0)","v":39},null,null,null,null,null,null,456]
[null,{"$f":"B456","v":154},"Lunch",{"$f":"ROUND(B456*0.3,0)","v":46},null,null,null,null,null,null,457]
[null,{"$f":"B456","v":154},"Dinner",{"$f":"ROUND(B456*0.45,0)","v":69},null,{"$f":"(D457+D456+D458)","v":154},{"$f":"(D457+D456+D458)-F458","v":0},null,null,null,458]
[null,155,"Breakfast",{"$f":"ROUND(B459*0.25,0)","v":39},null,null,null,null,null,null,459]
[null,{"$f":"B459","v":155},"Lunch",{"$f":"ROUND(B459*0.3,0)","v":47},null,null,null,null,null,null,460]
[null,{"$f":"B459","v":155},"Dinner",{"$f":"ROUND(B459*0.45,0)","v":70},null,{"$f":"(D460+D459+D461)","v":156},{"$f":"(D460+D459+D461)-F461","v":0},null,null,null,461]
[null,156,"Breakfast",{"$f":"ROUND(B462*0.25,0)","v":39},null,null,null,null,null,null,462]
[null,{"$f":"B462","v":156},"Lunch",{"$f":"ROUND(B462*0.3,0)","v":47},null,null,null,null,null,null,463]
[null,{"$f":"B462","v":156},"Dinner",{"$f":"ROUND(B462*0.45,0)","v":70},null,{"$f":"(D463+D462+D464)","v":156},{"$f":"(D463+D462+D464)-F464","v":0},null,null,null,464]
[null,157,"Breakfast",{"$f":"ROUND(B465*0.25,0)","v":39},null,null,null,null,null,null,465]
[null,{"$f":"B465","v":157},"Lunch",{"$f":"ROUND(B465*0.3,0)","v":47},null,null,null,null,null,null,466]
[null,{"$f":"B465","v":157},"Dinner",{"$f":"ROUND(B465*0.45,0)","v":71},null,{"$f":"(D466+D465+D467)","v":157},{"$f":"(D466+D465+D467)-F467","v":0},null,null,null,467]
[null,158,"Breakfast",{"$f":"ROUND(B468*0.25,0)","v":40},null,null,null,null,null,null,468]
[null,{"$f":"B468","v":158},"Lunch",{"$f":"ROUND(B468*0.3,0)","v":47},null,null,null,null,null,null,469]
[null,{"$f":"B468","v":158},"Dinner",{"$f":"ROUND(B468*0.45,0)","v":71},null,{"$f":"(D469+D468+D470)","v":158},{"$f":"(D469+D468+D470)-F470","v":0},null,null,null,470]
[null,159,"Breakfast",{"$f":"ROUND(B471*0.25,0)","v":40},null,null,null,null,null,null,471]
[null,{"$f":"B471","v":159},"Lunch",{"$f":"ROUND(B471*0.3,0)","v":48},null,null,null,null,null,null,472]
[null,{"$f":"B471","v":159},"Dinner",{"$f":"ROUND(B471*0.45,0)","v":72},null,{"$f":"(D472+D471+D473)","v":160},{"$f":"(D472+D471+D473)-F473","v":0},null,null,null,473]
[null,160,"Breakfast",{"$f":"ROUND(B474*0.25,0)","v":40},null,null,null,null,null,null,474]
[null,{"$f":"B474","v":160},"Lunch",{"$f":"ROUND(B474*0.3,0)","v":48},null,null,null,null,null,null,475]
[null,{"$f":"B474","v":160},"Dinner",{"$f":"ROUND(B474*0.45,0)","v":72},null,{"$f":"(D475+D474+D476)","v":160},{"$f":"(D475+D474+D476)-F476","v":0},null,null,null,476]
[null,161,"Breakfast",{"$f":"ROUND(B477*0.25,0)","v":40},null,null,null,null,null,null,477]
[null,{"$f":"B477","v":161},"Lunch",{"$f":"ROUND(B477*0.3,0)","v":48},null,null,null,null,null,null,478]
[null,{"$f":"B477","v":161},"Dinner",{"$f":"ROUND(B477*0.45,0)","v":72},null,{"$f":"(D478+D477+D479)","v":160},{"$f":"(D478+D477+D479)-F479","v":0},null,null,null,479]
[null,162,"Breakfast",{"$f":"ROUND(B480*0.25,0)","v":41},null,null,null,null,null,null,480]
[null,{"$f":"B480","v":162},"Lunch",{"$f":"ROUND(B480*0.3,0)","v":49},null,null,null,null,null,null,481]
[null,{"$f":"B480","v":162},"Dinner",{"$f":"ROUND(B480*0.45,0)","v":73},null,{"$f":"(D481+D480+D482)","v":163},{"$f":"(D481+D480+D482)-F482","v":0},null,null,null,482]
[null,163,"Breakfast",{"$f":"ROUND(B483*0.25,0)","v":41},null,null,null,null,null,null,483]
[null,{"$f":"B483","v":163},"Lunch",{"$f":"ROUND(B483*0.3,0)","v":49},null,null,null,null,null,null,484]
[null,{"$f":"B483","v":163},"Dinner",{"$f":"ROUND(B483*0.45,0)","v":73},null,{"$f":"(D484+D483+D485)","v":163},{"$f":"(D484+D483+D485)-F485","v":0},null,null,null,485]
[null,164,"Breakfast",{"$f":"ROUND(B486*0.25,0)","v":41},null,null,null,null,null,null,486]
[null,{"$f":"B486","v":164},"Lunch",{"$f":"ROUND(B486*0.3,0)","v":49},null,null,null,null,null,null,487]
[null,{"$f":"B486","v":164},"Dinner",{"$f":"ROUND(B486*0.45,0)","v":74},null,{"$f":"(D487+D486+D488)","v":164},{"$f":"(D487+D486+D488)-F488","v":0},null,null,null,488]
[null,165,"Breakfast",{"$f":"ROUND(B489*0.25,0)","v":41},null,null,null,null,null,null,489]
[null,{"$f":"B489","v":165},"Lunch",{"$f":"ROUND(B489*0.3,0)","v":50},null,null,null,null,null,null,490]
[null,{"$f":"B489","v":165},"Dinner",{"$f":"ROUND(B489*0.45,0)","v":74},null,{"$f":"(D490+D489+D491)","v":165},{"$f":"(D490+D489+D491)-F491","v":0},null,null,null,491]
[null,166,"Breakfast",{"$f":"ROUND(B492*0.25,0)","v":42},null,null,null,null,null,null,492]
[null,{"$f":"B492","v":166},"Lunch",{"$f":"ROUND(B492*0.3,0)","v":50},null,null,null,null,null,null,493]
[null,{"$f":"B492","v":166},"Dinner",{"$f":"ROUND(B492*0.45,0)","v":75},null,{"$f":"(D493+D492+D494)","v":167},{"$f":"(D493+D492+D494)-F494","v":0},null,null,null,494]
[null,167,"Breakfast",{"$f":"ROUND(B495*0.25,0)","v":42},null,null,null,null,null,null,495]
[null,{"$f":"B495","v":167},"Lunch",{"$f":"ROUND(B495*0.3,0)","v":50},null,null,null,null,null,null,496]
[null,{"$f":"B495","v":167},"Dinner",{"$f":"ROUND(B495*0.45,0)","v":75},null,{"$f":"(D496+D495+D497)","v":167},{"$f":"(D496+D495+D497)-F497","v":0},null,null,null,497]
[null,168,"Breakfast",{"$f":"ROUND(B498*0.25,0)","v":42},null,null,null,null,null,null,498]
[null,{"$f":"B498","v":168},"Lunch",{"$f":"ROUND(B498*0.3,0)","v":50},null,null,null,null,null,null,499]
[null,{"$f":"B498","v":168},"Dinner",{"$f":"ROUND(B498*0.45,0)","v":76},null,{"$f":"(D499+D498+D500)","v":168},{"$f":"(D499+D498+D500)-F500","v":0},null,null,null,500]
[null,169,"Breakfast",{"$f":"ROUND(B501*0.25,0)","v":42},null,null,null,null,null,null,501]
[null,{"$f":"B501","v":169},"Lunch",{"$f":"ROUND(B501*0.3,0)","v":51},null,null,null,null,null,null,502]
[null,{"$f":"B501","v":169},"Dinner",{"$f":"ROUND(B501*0.45,0)","v":76},null,{"$f":"(D502+D501+D503)","v":169},{"$f":"(D502+D501+D503)-F503","v":0},null,null,null,503]
[null,170,"Breakfast",{"$f":"ROUND(B504*0.25,0)","v":43},null,null,null,null,null,null,504]
[null,{"$f":"B504","v":170},"Lunch",{"$f":"ROUND(B504*0.3,0)","v":51},null,null,null,null,null,null,505]
[null,{"$f":"B504","v":170},"Dinner",{"$f":"ROUND(B504*0.45,0)","v":77},null,{"$f":"(D505+D504+D506)","v":171},{"$f":"(D505+D504+D506)-F506","v":0},null,null,null,506]
[null,171,"Breakfast",{"$f":"ROUND(B507*0.25,0)","v":43},null,null,null,null,null,null,507]
[null,{"$f":"B507","v":171},"Lunch",{"$f":"ROUND(B507*0.3,0)","v":51},null,null,null,null,null,null,508]
[null,{"$f":"B507","v":171},"Dinner",{"$f":"ROUND(B507*0.45,0)","v":77},null,{"$f":"(D508+D507+D509)","v":171},{"$f":"(D508+D507+D509)-F509","v":0},null,null,null,509]
[null,172,"Breakfast",{"$f":"ROUND(B510*0.25,0)","v":43},null,null,null,null,null,null,510]
[null,{"$f":"B510","v":172},"Lunch",{"$f":"ROUND(B510*0.3,0)","v":52},null,null,null,null,null,null,511]
[null,{"$f":"B510","v":172},"Dinner",{"$f":"ROUND(B510*0.45,0)","v":77},null,{"$f":"(D511+D510+D512)","v":172},{"$f":"(D511+D510+D512)-F512","v":0},null,null,null,512]
[null,173,"Breakfast",{"$f":"ROUND(B513*0.25,0)","v":43},null,null,null,null,null,null,513]
[null,{"$f":"B513","v":173},"Lunch",{"$f":"ROUND(B513*0.3,0)","v":52},null,null,null,null,null,null,514]
[null,{"$f":"B513","v":173},"Dinner",{"$f":"ROUND(B513*0.45,0)","v":78},null,{"$f":"(D514+D513+D515)","v":173},{"$f":"(D514+D513+D515)-F515","v":0},null,null,null,515]
[null,174,"Breakfast",{"$f":"ROUND(B516*0.25,0)","v":44},null,null,null,null,null,null,516]
[null,{"$f":"B516","v":174},"Lunch",{"$f":"ROUND(B516*0.3,0)","v":52},null,null,null,null,null,null,517]
[null,{"$f":"B516","v":174},"Dinner",{"$f":"ROUND(B516*0.45,0)","v":78},null,{"$f":"(D517+D516+D518)","v":174},{"$f":"(D517+D516+D518)-F518","v":0},null,null,null,518]
[null,175,"Breakfast",{"$f":"ROUND(B519*0.25,0)","v":44},null,null,null,null,null,null,519]
[null,{"$f":"B519","v":175},"Lunch",{"$f":"ROUND(B519*0.3,0)","v":53},null,null,null,null,null,null,520]
[null,{"$f":"B519","v":175},"Dinner",{"$f":"ROUND(B519*0.45,0)","v":79},null,{"$f":"(D520+D519+D521)","v":176},{"$f":"(D520+D519+D521)-F521","v":0},null,null,null,521]
[null,176,"Breakfast",{"$f":"ROUND(B522*0.25,0)","v":44},null,null,null,null,null,null,522]
[null,{"$f":"B522","v":176},"Lunch",{"$f":"ROUND(B522*0.3,0)","v":53},null,null,null,null,null,null,523]
[null,{"$f":"B522","v":176},"Dinner",{"$f":"ROUND(B522*0.45,0)","v":79},null,{"$f":"(D523+D522+D524)","v":176},{"$f":"(D523+D522+D524)-F524","v":0},null,null,null,524]
[null,177,"Breakfast",{"$f":"ROUND(B525*0.25,0)","v":44},null,null,null,null,null,null,525]
[null,{"$f":"B525","v":177},"Lunch",{"$f":"ROUND(B525*0.3,0)","v":53},null,null,null,null,null,null,526]
[null,{"$f":"B525","v":177},"Dinner",{"$f":"ROUND(B525*0.45,0)","v":80},null,{"$f":"(D526+D525+D527)","v":177},{"$f":"(D526+D525+D527)-F527","v":0},null,null,null,527]
[null,178,"Breakfast",{"$f":"ROUND(B528*0.25,0)","v":45},null,null,null,null,null,null,528]
[null,{"$f":"B528","v":178},"Lunch",{"$f":"ROUND(B528*0.3,0)","v":53},null,null,null,null,null,null,529]
[null,{"$f":"B528","v":178},"Dinner",{"$f":"ROUND(B528*0.45,0)","v":80},null,{"$f":"(D529+D528+D530)","v":178},{"$f":"(D529+D528+D530)-F530","v":0},null,null,null,530]
[null,179,"Breakfast",{"$f":"ROUND(B531*0.25,0)","v":45},null,null,null,null,null,null,531]
[null,{"$f":"B531","v":179},"Lunch",{"$f":"ROUND(B531*0.3,0)","v":54},null,null,null,null,null,null,532]
[null,{"$f":"B531","v":179},"Dinner",{"$f":"ROUND(B531*0.45,0)","v":81},null,{"$f":"(D532+D531+D533)","v":180},{"$f":"(D532+D531+D533)-F533","v":0},null,null,null,533]
[null,180,"Breakfast",{"$f":"ROUND(B534*0.25,0)","v":45},null,null,null,null,null,null,534]
[null,{"$f":"B534","v":180},"Lunch",{"$f":"ROUND(B534*0.3,0)","v":54},null,null,null,null,null,null,535]
[null,{"$f":"B534","v":180},"Dinner",{"$f":"ROUND(B534*0.45,0)","v":81},null,{"$f":"(D535+D534+D536)","v":180},{"$f":"(D535+D534+D536)-F536","v":0},null,null,null,536]
[null,181,"Breakfast",{"$f":"ROUND(B537*0.25,0)","v":45},null,null,null,null,null,null,537]
[null,{"$f":"B537","v":181},"Lunch",{"$f":"ROUND(B537*0.3,0)","v":54},null,null,null,null,null,null,538]
[null,{"$f":"B537","v":181},"Dinner",{"$f":"ROUND(B537*0.45,0)","v":81},null,{"$f":"(D538+D537+D539)","v":180},{"$f":"(D538+D537+D539)-F539","v":0},null,null,null,539]
[null,182,"Breakfast",{"$f":"ROUND(B540*0.25,0)","v":46},null,null,null,null,null,null,540]
[null,{"$f":"B540","v":182},"Lunch",{"$f":"ROUND(B540*0.3,0)","v":55},null,null,null,null,null,null,541]
[null,{"$f":"B540","v":182},"Dinner",{"$f":"ROUND(B540*0.45,0)","v":82},null,{"$f":"(D541+D540+D542)","v":183},{"$f":"(D541+D540+D542)-F542","v":0},null,null,null,542]
[null,183,"Breakfast",{"$f":"ROUND(B543*0.25,0)","v":46},null,null,null,null,null,null,543]
[null,{"$f":"B543","v":183},"Lunch",{"$f":"ROUND(B543*0.3,0)","v":55},null,null,null,null,null,null,544]
[null,{"$f":"B543","v":183},"Dinner",{"$f":"ROUND(B543*0.45,0)","v":82},null,{"$f":"(D544+D543+D545)","v":183},{"$f":"(D544+D543+D545)-F545","v":0},null,null,null,545]
[null,184,"Breakfast",{"$f":"ROUND(B546*0.25,0)","v":46},null,null,null,null,null,null,546]
[null,{"$f":"B546","v":184},"Lunch",{"$f":"ROUND(B546*0.3,0)","v":55},null,null,null,null,null,null,547]
[null,{"$f":"B546","v":184},"Dinner",{"$f":"ROUND(B546*0.45,0)","v":83},null,{"$f":"(D547+D546+D548)","v":184},{"$f":"(D547+D546+D548)-F548","v":0},null,null,null,548]
[null,185,"Breakfast",{"$f":"ROUND(B549*0.25,0)","v":46},null,null,null,null,null,null,549]
[null,{"$f":"B549","v":185},"Lunch",{"$f":"ROUND(B549*0.3,0)","v":56},null,null,null,null,null,null,550]
[null,{"$f":"B549","v":185},"Dinner",{"$f":"ROUND(B549*0.45,0)","v":83},null,{"$f":"(D550+D549+D551)","v":185},{"$f":"(D550+D549+D551)-F551","v":0},null,null,null,551]
[null,186,"Breakfast",{"$f":"ROUND(B552*0.25,0)","v":47},null,null,null,null,null,null,552]
[null,{"$f":"B552","v":186},"Lunch",{"$f":"ROUND(B552*0.3,0)","v":56},null,null,null,null,null,null,553]
[null,{"$f":"B552","v":186},"Dinner",{"$f":"ROUND(B552*0.45,0)","v":84},null,{"$f":"(D553+D552+D554)","v":187},{"$f":"(D553+D552+D554)-F554","v":0},null,null,null,554]
[null,187,"Breakfast",{"$f":"ROUND(B555*0.25,0)","v":47},null,null,null,null,null,null,555]
[null,{"$f":"B555","v":187},"Lunch",{"$f":"ROUND(B555*0.3,0)","v":56}]
[null,{"$f":"B555","v":187},"Dinner",{"$f":"ROUND(B555*0.45,0)","v":84},null,{"$f":"(D556+D555+D557)","v":187},{"$f":"(D556+D555+D557)-F557","v":0}]
[null,188,"Breakfast",{"$f":"ROUND(B558*0.25,0)","v":47}]
[null,{"$f":"B558","v":188},"Lunch",{"$f":"ROUND(B558*0.3,0)","v":56}]
[null,{"$f":"B558","v":188},"Dinner",{"$f":"ROUND(B558*0.45,0)","v":85},null,{"$f":"(D559+D558+D560)","v":188},{"$f":"(D559+D558+D560)-F560","v":0}]
[null,189,"Breakfast",{"$f":"ROUND(B561*0.25,0)","v":47}]
[null,{"$f":"B561","v":189},"Lunch",{"$f":"ROUND(B561*0.3,0)","v":57}]
[null,{"$f":"B561","v":189},"Dinner",{"$f":"ROUND(B561*0.45,0)","v":85},null,{"$f":"(D562+D561+D563)","v":189},{"$f":"(D562+D561+D563)-F563","v":0}]
[null,190,"Breakfast",{"$f":"ROUND(B564*0.25,0)","v":48}]
[null,{"$f":"B564","v":190},"Lunch",{"$f":"ROUND(B564*0.3,0)","v":57}]
[null,{"$f":"B564","v":190},"Dinner",{"$f":"ROUND(B564*0.45,0)","v":86},null,{"$f":"(D565+D564+D566)","v":191},{"$f":"(D565+D564+D566)-F566","v":0}]
[null,191,"Breakfast",{"$f":"ROUND(B567*0.25,0)","v":48}]
[null,{"$f":"B567","v":191},"Lunch",{"$f":"ROUND(B567*0.3,0)","v":57}]
[null,{"$f":"B567","v":191},"Dinner",{"$f":"ROUND(B567*0.45,0)","v":86},null,{"$f":"(D568+D567+D569)","v":191},{"$f":"(D568+D567+D569)-F569","v":0}]
[null,192,"Breakfast",{"$f":"ROUND(B570*0.25,0)","v":48}]
[null,{"$f":"B570","v":192},"Lunch",{"$f":"ROUND(B570*0.3,0)","v":58}]
[null,{"$f":"B570","v":192},"Dinner",{"$f":"ROUND(B570*0.45,0)","v":86},null,{"$f":"(D571+D570+D572)","v":192},{"$f":"(D571+D570+D572)-F572","v":0}]
[null,193,"Breakfast",{"$f":"ROUND(B573*0.25,0)","v":48}]
[null,{"$f":"B573","v":193},"Lunch",{"$f":"ROUND(B573*0.3,0)","v":58}]
[null,{"$f":"B573","v":193},"Dinner",{"$f":"ROUND(B573*0.45,0)","v":87},null,{"$f":"(D574+D573+D575)","v":193},{"$f":"(D574+D573+D575)-F575","v":0}]
[null,194,"Breakfast",{"$f":"ROUND(B576*0.25,0)","v":49}]
[null,{"$f":"B576","v":194},"Lunch",{"$f":"ROUND(B576*0.3,0)","v":58}]
[null,{"$f":"B576","v":194},"Dinner",{"$f":"ROUND(B576*0.45,0)","v":87},null,{"$f":"(D577+D576+D578)","v":194},{"$f":"(D577+D576+D578)-F578","v":0}]
[null,195,"Breakfast",{"$f":"ROUND(B579*0.25,0)","v":49}]
[null,{"$f":"B579","v":195},"Lunch",{"$f":"ROUND(B579*0.3,0)","v":59}]
[null,{"$f":"B579","v":195},"Dinner",{"$f":"ROUND(B579*0.45,0)","v":88},null,{"$f":"(D580+D579+D581)","v":196},{"$f":"(D580+D579+D581)-F581","v":0}]
[null,196,"Breakfast",{"$f":"ROUND(B582*0.25,0)","v":49}]
[null,{"$f":"B582","v":196},"Lunch",{"$f":"ROUND(B582*0.3,0)","v":59}]
[null,{"$f":"B582","v":196},"Dinner",{"$f":"ROUND(B582*0.45,0)","v":88},null,{"$f":"(D583+D582+D584)","v":196},{"$f":"(D583+D582+D584)-F584","v":0}]
[null,197,"Breakfast",{"$f":"ROUND(B585*0.25,0)","v":49}]
[null,{"$f":"B585","v":197},"Lunch",{"$f":"ROUND(B585*0.3,0)","v":59}]
[null,{"$f":"B585","v":197},"Dinner",{"$f":"ROUND(B585*0.45,0)","v":89},null,{"$f":"(D586+D585+D587)","v":197},{"$f":"(D586+D585+D587)-F587","v":0}]
[null,198,"Breakfast",{"$f":"ROUND(B588*0.25,0)","v":50}]
[null,{"$f":"B588","v":198},"Lunch",{"$f":"ROUND(B588*0.3,0)","v":59}]
[null,{"$f":"B588","v":198},"Dinner",{"$f":"ROUND(B588*0.45,0)","v":89},null,{"$f":"(D589+D588+D590)","v":198},{"$f":"(D589+D588+D590)-F590","v":0}]
[null,199,"Breakfast",{"$f":"ROUND(B591*0.25,0)","v":50}]
[null,{"$f":"B591","v":199},"Lunch",{"$f":"ROUND(B591*0.3,0)","v":60}]
[null,{"$f":"B591","v":199},"Dinner",{"$f":"ROUND(B591*0.45,0)","v":90},null,{"$f":"(D592+D591+D593)","v":200},{"$f":"(D592+D591+D593)-F593","v":0}]
[null,200,"Breakfast",{"$f":"ROUND(B594*0.25,0)","v":50}]
[null,{"$f":"B594","v":200},"Lunch",{"$f":"ROUND(B594*0.3,0)","v":60}]
[null,{"$f":"B594","v":200},"Dinner",{"$f":"ROUND(B594*0.45,0)","v":90},null,{"$f":"(D595+D594+D596)","v":200},{"$f":"(D595+D594+D596)-F596","v":0}]
[null,201,"Breakfast",{"$f":"ROUND(B597*0.25,0)","v":50}]
[null,{"$f":"B597","v":201},"Lunch",{"$f":"ROUND(B597*0.3,0)","v":60}]
[null,{"$f":"B597","v":201},"Dinner",{"$f":"ROUND(B597*0.45,0)","v":90},null,{"$f":"(D598+D597+D599)","v":200},{"$f":"(D598+D597+D599)-F599","v":0}]
[null,202,"Breakfast",{"$f":"ROUND(B600*0.25,0)","v":51}]
[null,{"$f":"B600","v":202},"Lunch",{"$f":"ROUND(B600*0.3,0)","v":61}]
[null,{"$f":"B600","v":202},"Dinner",{"$f":"ROUND(B600*0.45,0)","v":91},null,{"$f":"(D601+D600+D602)","v":203},{"$f":"(D601+D600+D602)-F602","v":0}]
[null,203,"Breakfast",{"$f":"ROUND(B603*0.25,0)","v":51}]
[null,{"$f":"B603","v":203},"Lunch",{"$f":"ROUND(B603*0.3,0)","v":61}]
[null,{"$f":"B603","v":203},"Dinner",{"$f":"ROUND(B603*0.45,0)","v":91},null,{"$f":"(D604+D603+D605)","v":203},{"$f":"(D604+D603+D605)-F605","v":0}]
[null,204,"Breakfast",{"$f":"ROUND(B606*0.25,0)","v":51}]
[null,{"$f":"B606","v":204},"Lunch",{"$f":"ROUND(B606*0.3,0)","v":61}]
[null,{"$f":"B606","v":204},"Dinner",{"$f":"ROUND(B606*0.45,0)","v":92},null,{"$f":"(D607+D606+D608)","v":204},{"$f":"(D607+D606+D608)-F608","v":0}]
[null,205,"Breakfast",{"$f":"ROUND(B609*0.25,0)","v":51}]
[null,{"$f":"B609","v":205},"Lunch",{"$f":"ROUND(B609*0.3,0)","v":62}]
[null,{"$f":"B609","v":205},"Dinner",{"$f":"ROUND(B609*0.45,0)","v":92},null,{"$f":"(D610+D609+D611)","v":205},{"$f":"(D610+D609+D611)-F611","v":0}]
[null,206,"Breakfast",{"$f":"ROUND(B612*0.25,0)","v":52}]
[null,{"$f":"B612","v":206},"Lunch",{"$f":"ROUND(B612*0.3,0)","v":62}]
[null,{"$f":"B612","v":206},"Dinner",{"$f":"ROUND(B612*0.45,0)","v":93},null,{"$f":"(D613+D612+D614)","v":207},{"$f":"(D613+D612+D614)-F614","v":0}]
[null,207,"Breakfast",{"$f":"ROUND(B615*0.25,0)","v":52}]
[null,{"$f":"B615","v":207},"Lunch",{"$f":"ROUND(B615*0.3,0)","v":62}]
[null,{"$f":"B615","v":207},"Dinner",{"$f":"ROUND(B615*0.45,0)","v":93},null,{"$f":"(D616+D615+D617)","v":207},{"$f":"(D616+D615+D617)-F617","v":0}]
[null,208,"Breakfast",{"$f":"ROUND(B618*0.25,0)","v":52}]
[null,{"$f":"B618","v":208},"Lunch",{"$f":"ROUND(B618*0.3,0)","v":62}]
[null,{"$f":"B618","v":208},"Dinner",{"$f":"ROUND(B618*0.45,0)","v":94},null,{"$f":"(D619+D618+D620)","v":208},{"$f":"(D619+D618+D620)-F620","v":0}]
[null,209,"Breakfast",{"$f":"ROUND(B621*0.25,0)","v":52}]
[null,{"$f":"B621","v":209},"Lunch",{"$f":"ROUND(B621*0.3,0)","v":63}]
[null,{"$f":"B621","v":209},"Dinner",{"$f":"ROUND(B621*0.45,0)","v":94},null,{"$f":"(D622+D621+D623)","v":209},{"$f":"(D622+D621+D623)-F623","v":0}]
[null,210,"Breakfast",{"$f":"ROUND(B624*0.25,0)","v":53}]
[null,{"$f":"B624","v":210},"Lunch",{"$f":"ROUND(B624*0.3,0)","v":63}]
[null,{"$f":"B624","v":210},"Dinner",{"$f":"ROUND(B624*0.45,0)","v":95},null,{"$f":"(D625+D624+D626)","v":211},{"$f":"(D625+D624+D626)-F626","v":0}]
[null,211,"Breakfast",{"$f":"ROUND(B627*0.25,0)","v":53}]
[null,{"$f":"B627","v":211},"Lunch",{"$f":"ROUND(B627*0.3,0)","v":63}]
[null,{"$f":"B627","v":211},"Dinner",{"$f":"ROUND(B627*0.45,0)","v":95},null,{"$f":"(D628+D627+D629)","v":211},{"$f":"(D628+D627+D629)-F629","v":0}]
[null,212,"Breakfast",{"$f":"ROUND(B630*0.25,0)","v":53}]
[null,{"$f":"B630","v":212},"Lunch",{"$f":"ROUND(B630*0.3,0)","v":64}]
[null,{"$f":"B630","v":212},"Dinner",{"$f":"ROUND(B630*0.45,0)","v":95},null,{"$f":"(D631+D630+D632)","v":212},{"$f":"(D631+D630+D632)-F632","v":0}]
[null,213,"Breakfast",{"$f":"ROUND(B633*0.25,0)","v":53}]
[null,{"$f":"B633","v":213},"Lunch",{"$f":"ROUND(B633*0.3,0)","v":64}]
[null,{"$f":"B633","v":213},"Dinner",{"$f":"ROUND(B633*0.45,0)","v":96},null,{"$f":"(D634+D633+D635)","v":213},{"$f":"(D634+D633+D635)-F635","v":0}]
[null,214,"Breakfast",{"$f":"ROUND(B636*0.25,0)","v":54}]
[null,{"$f":"B636","v":214},"Lunch",{"$f":"ROUND(B636*0.3,0)","v":64}]
[null,{"$f":"B636","v":214},"Dinner",{"$f":"ROUND(B636*0.45,0)","v":96},null,{"$f":"(D637+D636+D638)","v":214},{"$f":"(D637+D636+D638)-F638","v":0}]
[null,215,"Breakfast",{"$f":"ROUND(B639*0.25,0)","v":54}]
[null,{"$f":"B639","v":215},"Lunch",{"$f":"ROUND(B639*0.3,0)","v":65}]
[null,{"$f":"B639","v":215},"Dinner",{"$f":"ROUND(B639*0.45,0)","v":97},null,{"$f":"(D640+D639+D641)","v":216},{"$f":"(D640+D639+D641)-F641","v":0}]
[null,216,"Breakfast",{"$f":"ROUND(B642*0.25,0)","v":54}]
[null,{"$f":"B642","v":216},"Lunch",{"$f":"ROUND(B642*0.3,0)","v":65}]
[null,{"$f":"B642","v":216},"Dinner",{"$f":"ROUND(B642*0.45,0)","v":97},null,{"$f":"(D643+D642+D644)","v":216},{"$f":"(D643+D642+D644)-F644","v":0}]
[null,217,"Breakfast",{"$f":"ROUND(B645*0.25,0)","v":54}]
[null,{"$f":"B645","v":217},"Lunch",{"$f":"ROUND(B645*0.3,0)","v":65}]
[null,{"$f":"B645","v":217},"Dinner",{"$f":"ROUND(B645*0.45,0)","v":98},null,{"$f":"(D646+D645+D647)","v":217},{"$f":"(D646+D645+D647)-F647","v":0}]
[null,218,"Breakfast",{"$f":"ROUND(B648*0.25,0)","v":55}]
[null,{"$f":"B648","v":218},"Lunch",{"$f":"ROUND(B648*0.3,0)","v":65}]
[null,{"$f":"B648","v":218},"Dinner",{"$f":"ROUND(B648*0.45,0)","v":98},null,{"$f":"(D649+D648+D650)","v":218},{"$f":"(D649+D648+D650)-F650","v":0}]
[null,219,"Breakfast",{"$f":"ROUND(B651*0.25,0)","v":55}]
[null,{"$f":"B651","v":219},"Lunch",{"$f":"ROUND(B651*0.3,0)","v":66}]
[null,{"$f":"B651","v":219},"Dinner",{"$f":"ROUND(B651*0.45,0)","v":99},null,{"$f":"(D652+D651+D653)","v":220},{"$f":"(D652+D651+D653)-F653","v":0}]
[null,220,"Breakfast",{"$f":"ROUND(B654*0.25,0)","v":55}]
[null,{"$f":"B654","v":220},"Lunch",{"$f":"ROUND(B654*0.3,0)","v":66}]
[null,{"$f":"B654","v":220},"Dinner",{"$f":"ROUND(B654*0.45,0)","v":99},null,{"$f":"(D655+D654+D656)","v":220},{"$f":"(D655+D654+D656)-F656","v":0}]
[null,221,"Breakfast",{"$f":"ROUND(B657*0.25,0)","v":55}]
[null,{"$f":"B657","v":221},"Lunch",{"$f":"ROUND(B657*0.3,0)","v":66}]
[null,{"$f":"B657","v":221},"Dinner",{"$f":"ROUND(B657*0.45,0)","v":99},null,{"$f":"(D658+D657+D659)","v":220},{"$f":"(D658+D657+D659)-F659","v":0}]
[null,222,"Breakfast",{"$f":"ROUND(B660*0.25,0)","v":56}]
[null,{"$f":"B660","v":222},"Lunch",{"$f":"ROUND(B660*0.3,0)","v":67}]
[null,{"$f":"B660","v":222},"Dinner",{"$f":"ROUND(B660*0.45,0)","v":100},null,{"$f":"(D661+D660+D662)","v":223},{"$f":"(D661+D660+D662)-F662","v":0}]
[null,223,"Breakfast",{"$f":"ROUND(B663*0.25,0)","v":56}]
[null,{"$f":"B663","v":223},"Lunch",{"$f":"ROUND(B663*0.3,0)","v":67}]
[null,{"$f":"B663","v":223},"Dinner",{"$f":"ROUND(B663*0.45,0)","v":100},null,{"$f":"(D664+D663+D665)","v":223},{"$f":"(D664+D663+D665)-F665","v":0}]
[null,224,"Breakfast",{"$f":"ROUND(B666*0.25,0)","v":56}]
[null,{"$f":"B666","v":224},"Lunch",{"$f":"ROUND(B666*0.3,0)","v":67}]
[null,{"$f":"B666","v":224},"Dinner",{"$f":"ROUND(B666*0.45,0)","v":101},null,{"$f":"(D667+D666+D668)","v":224},{"$f":"(D667+D666+D668)-F668","v":0}]
[null,225,"Breakfast",{"$f":"ROUND(B669*0.25,0)","v":56}]
[null,{"$f":"B669","v":225},"Lunch",{"$f":"ROUND(B669*0.3,0)","v":68}]
[null,{"$f":"B669","v":225},"Dinner",{"$f":"ROUND(B669*0.45,0)","v":101},null,{"$f":"(D670+D669+D671)","v":225},{"$f":"(D670+D669+D671)-F671","v":0}]
[null,226,"Breakfast",{"$f":"ROUND(B672*0.25,0)","v":57}]
[null,{"$f":"B672","v":226},"Lunch",{"$f":"ROUND(B672*0.3,0)","v":68}]
[null,{"$f":"B672","v":226},"Dinner",{"$f":"ROUND(B672*0.45,0)","v":102},null,{"$f":"(D673+D672+D674)","v":227},{"$f":"(D673+D672+D674)-F674","v":0}]
[null,227,"Breakfast",{"$f":"ROUND(B675*0.25,0)","v":57}]
[null,{"$f":"B675","v":227},"Lunch",{"$f":"ROUND(B675*0.3,0)","v":68}]
[null,{"$f":"B675","v":227},"Dinner",{"$f":"ROUND(B675*0.45,0)","v":102},null,{"$f":"(D676+D675+D677)","v":227},{"$f":"(D676+D675+D677)-F677","v":0}]
[null,228,"Breakfast",{"$f":"ROUND(B678*0.25,0)","v":57}]
[null,{"$f":"B678","v":228},"Lunch",{"$f":"ROUND(B678*0.3,0)","v":68}]
[null,{"$f":"B678","v":228},"Dinner",{"$f":"ROUND(B678*0.45,0)","v":103},null,{"$f":"(D679+D678+D680)","v":228},{"$f":"(D679+D678+D680)-F680","v":0}]
[null,229,"Breakfast",{"$f":"ROUND(B681*0.25,0)","v":57}]
[null,{"$f":"B681","v":229},"Lunch",{"$f":"ROUND(B681*0.3,0)","v":69}]
[null,{"$f":"B681","v":229},"Dinner",{"$f":"ROUND(B681*0.45,0)","v":103},null,{"$f":"(D682+D681+D683)","v":229},{"$f":"(D682+D681+D683)-F683","v":0}]
[null,230,"Breakfast",{"$f":"ROUND(B684*0.25,0)","v":58}]
[null,{"$f":"B684","v":230},"Lunch",{"$f":"ROUND(B684*0.3,0)","v":69}]
[null,{"$f":"B684","v":230},"Dinner",{"$f":"ROUND(B684*0.45,0)","v":104},null,{"$f":"(D685+D684+D686)","v":231},{"$f":"(D685+D684+D686)-F686","v":0}]
[null,231,"Breakfast",{"$f":"ROUND(B687*0.25,0)","v":58}]
[null,{"$f":"B687","v":231},"Lunch",{"$f":"ROUND(B687*0.3,0)","v":69}]
[null,{"$f":"B687","v":231},"Dinner",{"$f":"ROUND(B687*0.45,0)","v":104},null,{"$f":"(D688+D687+D689)","v":231},{"$f":"(D688+D687+D689)-F689","v":0}]
[null,232,"Breakfast",{"$f":"ROUND(B690*0.25,0)","v":58}]
[null,{"$f":"B690","v":232},"Lunch",{"$f":"ROUND(B690*0.3,0)","v":70}]
[null,{"$f":"B690","v":232},"Dinner",{"$f":"ROUND(B690*0.45,0)","v":104},null,{"$f":"(D691+D690+D692)","v":232},{"$f":"(D691+D690+D692)-F692","v":0}]
[null,233,"Breakfast",{"$f":"ROUND(B693*0.25,0)","v":58}]
[null,{"$f":"B693","v":233},"Lunch",{"$f":"ROUND(B693*0.3,0)","v":70}]
[null,{"$f":"B693","v":233},"Dinner",{"$f":"ROUND(B693*0.45,0)","v":105},null,{"$f":"(D694+D693+D695)","v":233},{"$f":"(D694+D693+D695)-F695","v":0}]
[null,234,"Breakfast",{"$f":"ROUND(B696*0.25,0)","v":59}]
[null,{"$f":"B696","v":234},"Lunch",{"$f":"ROUND(B696*0.3,0)","v":70}]
[null,{"$f":"B696","v":234},"Dinner",{"$f":"ROUND(B696*0.45,0)","v":105},null,{"$f":"(D697+D696+D698)","v":234},{"$f":"(D697+D696+D698)-F698","v":0}]
[null,235,"Breakfast",{"$f":"ROUND(B699*0.25,0)","v":59}]
[null,{"$f":"B699","v":235},"Lunch",{"$f":"ROUND(B699*0.3,0)","v":71}]
[null,{"$f":"B699","v":235},"Dinner",{"$f":"ROUND(B699*0.45,0)","v":106},null,{"$f":"(D700+D699+D701)","v":236},{"$f":"(D700+D699+D701)-F701","v":0}]
[null,236,"Breakfast",{"$f":"ROUND(B702*0.25,0)","v":59}]
[null,{"$f":"B702","v":236},"Lunch",{"$f":"ROUND(B702*0.3,0)","v":71}]
[null,{"$f":"B702","v":236},"Dinner",{"$f":"ROUND(B702*0.45,0)","v":106},null,{"$f":"(D703+D702+D704)","v":236},{"$f":"(D703+D702+D704)-F704","v":0}]
[null,237,"Breakfast",{"$f":"ROUND(B705*0.25,0)","v":59}]
[null,{"$f":"B705","v":237},"Lunch",{"$f":"ROUND(B705*0.3,0)","v":71}]
[null,{"$f":"B705","v":237},"Dinner",{"$f":"ROUND(B705*0.45,0)","v":107},null,{"$f":"(D706+D705+D707)","v":237},{"$f":"(D706+D705+D707)-F707","v":0}]
[null,238,"Breakfast",{"$f":"ROUND(B708*0.25,0)","v":60}]
[null,{"$f":"B708","v":238},"Lunch",{"$f":"ROUND(B708*0.3,0)","v":71}]
[null,{"$f":"B708","v":238},"Dinner",{"$f":"ROUND(B708*0.45,0)","v":107},null,{"$f":"(D709+D708+D710)","v":238},{"$f":"(D709+D708+D710)-F710","v":0}]
[null,239,"Breakfast",{"$f":"ROUND(B711*0.25,0)","v":60}]
[null,{"$f":"B711","v":239},"Lunch",{"$f":"ROUND(B711*0.3,0)","v":72}]
[null,{"$f":"B711","v":239},"Dinner",{"$f":"ROUND(B711*0.45,0)","v":108},null,{"$f":"(D712+D711+D713)","v":240},{"$f":"(D712+D711+D713)-F713","v":0}]
[null,240,"Breakfast",{"$f":"ROUND(B714*0.25,0)","v":60}]
[null,{"$f":"B714","v":240},"Lunch",{"$f":"ROUND(B714*0.3,0)","v":72}]
[null,{"$f":"B714","v":240},"Dinner",{"$f":"ROUND(B714*0.45,0)","v":108},null,{"$f":"(D715+D714+D716)","v":240},{"$f":"(D715+D714+D716)-F716","v":0}]
[null,241,"Breakfast",{"$f":"ROUND(B717*0.25,0)","v":60}]
[null,{"$f":"B717","v":241},"Lunch",{"$f":"ROUND(B717*0.3,0)","v":72}]
[null,{"$f":"B717","v":241},"Dinner",{"$f":"ROUND(B717*0.45,0)","v":108},null,{"$f":"(D718+D717+D719)","v":240},{"$f":"(D718+D717+D719)-F719","v":0}]
[null,242,"Breakfast",{"$f":"ROUND(B720*0.25,0)","v":61}]
[null,{"$f":"B720","v":242},"Lunch",{"$f":"ROUND(B720*0.3,0)","v":73}]
[null,{"$f":"B720","v":242},"Dinner",{"$f":"ROUND(B720*0.45,0)","v":109},null,{"$f":"(D721+D720+D722)","v":243},{"$f":"(D721+D720+D722)-F722","v":0}]
[null,243,"Breakfast",{"$f":"ROUND(B723*0.25,0)","v":61}]
[null,{"$f":"B723","v":243},"Lunch",{"$f":"ROUND(B723*0.3,0)","v":73}]
[null,{"$f":"B723","v":243},"Dinner",{"$f":"ROUND(B723*0.45,0)","v":109},null,{"$f":"(D724+D723+D725)","v":243},{"$f":"(D724+D723+D725)-F725","v":0}]
[null,244,"Breakfast",{"$f":"ROUND(B726*0.25,0)","v":61}]
[null,{"$f":"B726","v":244},"Lunch",{"$f":"ROUND(B726*0.3,0)","v":73}]
[null,{"$f":"B726","v":244},"Dinner",{"$f":"ROUND(B726*0.45,0)","v":110},null,{"$f":"(D727+D726+D728)","v":244},{"$f":"(D727+D726+D728)-F728","v":0}]
[null,245,"Breakfast",{"$f":"ROUND(B729*0.25,0)","v":61}]
[null,{"$f":"B729","v":245},"Lunch",{"$f":"ROUND(B729*0.3,0)","v":74}]
[null,{"$f":"B729","v":245},"Dinner",{"$f":"ROUND(B729*0.45,0)","v":110},null,{"$f":"(D730+D729+D731)","v":245},{"$f":"(D730+D729+D731)-F731","v":0}]
[null,246,"Breakfast",{"$f":"ROUND(B732*0.25,0)","v":62}]
[null,{"$f":"B732","v":246},"Lunch",{"$f":"ROUND(B732*0.3,0)","v":74}]
[null,{"$f":"B732","v":246},"Dinner",{"$f":"ROUND(B732*0.45,0)","v":111},null,{"$f":"(D733+D732+D734)","v":247},{"$f":"(D733+D732+D734)-F734","v":0}]
[null,247,"Breakfast",{"$f":"ROUND(B735*0.25,0)","v":62}]
[null,{"$f":"B735","v":247},"Lunch",{"$f":"ROUND(B735*0.3,0)","v":74}]
[null,{"$f":"B735","v":247},"Dinner",{"$f":"ROUND(B735*0.45,0)","v":111},null,{"$f":"(D736+D735+D737)","v":247},{"$f":"(D736+D735+D737)-F737","v":0}]
[null,248,"Breakfast",{"$f":"ROUND(B738*0.25,0)","v":62}]
[null,{"$f":"B738","v":248},"Lunch",{"$f":"ROUND(B738*0.3,0)","v":74}]
[null,{"$f":"B738","v":248},"Dinner",{"$f":"ROUND(B738*0.45,0)","v":112},null,{"$f":"(D739+D738+D740)","v":248},{"$f":"(D739+D738+D740)-F740","v":0}]
[null,249,"Breakfast",{"$f":"ROUND(B741*0.25,0)","v":62}]
[null,{"$f":"B741","v":249},"Lunch",{"$f":"ROUND(B741*0.3,0)","v":75}]
[null,{"$f":"B741","v":249},"Dinner",{"$f":"ROUND(B741*0.45,0)","v":112},null,{"$f":"(D742+D741+D743)","v":249},{"$f":"(D742+D741+D743)-F743","v":0}]
[null,250,"Breakfast",{"$f":"ROUND(B744*0.25,0)","v":63}]
[null,{"$f":"B744","v":250},"Lunch",{"$f":"ROUND(B744*0.3,0)","v":75}]
[null,{"$f":"B744","v":250},"Dinner",{"$f":"ROUND(B744*0.45,0)","v":113},null,{"$f":"(D745+D744+D746)","v":251},{"$f":"(D745+D744+D746)-F746","v":0}]
[null,251,"Breakfast",{"$f":"ROUND(B747*0.25,0)","v":63}]
[null,{"$f":"B747","v":251},"Lunch",{"$f":"ROUND(B747*0.3,0)","v":75}]
[null,{"$f":"B747","v":251},"Dinner",{"$f":"ROUND(B747*0.45,0)","v":113},null,{"$f":"(D748+D747+D749)","v":251},{"$f":"(D748+D747+D749)-F749","v":0}]
[null,252,"Breakfast",{"$f":"ROUND(B750*0.25,0)","v":63}]
[null,{"$f":"B750","v":252},"Lunch",{"$f":"ROUND(B750*0.3,0)","v":76}]
[null,{"$f":"B750","v":252},"Dinner",{"$f":"ROUND(B750*0.45,0)","v":113},null,{"$f":"(D751+D750+D752)","v":252},{"$f":"(D751+D750+D752)-F752","v":0}]
[null,253,"Breakfast",{"$f":"ROUND(B753*0.25,0)","v":63}]
[null,{"$f":"B753","v":253},"Lunch",{"$f":"ROUND(B753*0.3,0)","v":76}]
[null,{"$f":"B753","v":253},"Dinner",{"$f":"ROUND(B753*0.45,0)","v":114},null,{"$f":"(D754+D753+D755)","v":253},{"$f":"(D754+D753+D755)-F755","v":0}]
[null,254,"Breakfast",{"$f":"ROUND(B756*0.25,0)","v":64}]
[null,{"$f":"B756","v":254},"Lunch",{"$f":"ROUND(B756*0.3,0)","v":76}]
[null,{"$f":"B756","v":254},"Dinner",{"$f":"ROUND(B756*0.45,0)","v":114},null,{"$f":"(D757+D756+D758)","v":254},{"$f":"(D757+D756+D758)-F758","v":0}]
[null,255,"Breakfast",{"$f":"ROUND(B759*0.25,0)","v":64}]
[null,{"$f":"B759","v":255},"Lunch",{"$f":"ROUND(B759*0.3,0)","v":77}]
[null,{"$f":"B759","v":255},"Dinner",{"$f":"ROUND(B759*0.45,0)","v":115},null,{"$f":"(D760+D759+D761)","v":256},{"$f":"(D760+D759+D761)-F761","v":0}]
[null,256,"Breakfast",{"$f":"ROUND(B762*0.25,0)","v":64}]
[null,{"$f":"B762","v":256},"Lunch",{"$f":"ROUND(B762*0.3,0)","v":77}]
[null,{"$f":"B762","v":256},"Dinner",{"$f":"ROUND(B762*0.45,0)","v":115},null,{"$f":"(D763+D762+D764)","v":256},{"$f":"(D763+D762+D764)-F764","v":0}]
[null,257,"Breakfast",{"$f":"ROUND(B765*0.25,0)","v":64}]
[null,{"$f":"B765","v":257},"Lunch",{"$f":"ROUND(B765*0.3,0)","v":77}]
[null,{"$f":"B765","v":257},"Dinner",{"$f":"ROUND(B765*0.45,0)","v":116},null,{"$f":"(D766+D765+D767)","v":257},{"$f":"(D766+D765+D767)-F767","v":0}]
[null,258,"Breakfast",{"$f":"ROUND(B768*0.25,0)","v":65}]
[null,{"$f":"B768","v":258},"Lunch",{"$f":"ROUND(B768*0.3,0)","v":77}]
[null,{"$f":"B768","v":258},"Dinner",{"$f":"ROUND(B768*0.45,0)","v":116},null,{"$f":"(D769+D768+D770)","v":258},{"$f":"(D769+D768+D770)-F770","v":0}]
[null,259,"Breakfast",{"$f":"ROUND(B771*0.25,0)","v":65}]
[null,{"$f":"B771","v":259},"Lunch",{"$f":"ROUND(B771*0.3,0)","v":78}]
[null,{"$f":"B771","v":259},"Dinner",{"$f":"ROUND(B771*0.45,0)","v":117},null,{"$f":"(D772+D771+D773)","v":260},{"$f":"(D772+D771+D773)-F773","v":0}]
[null,260,"Breakfast",{"$f":"ROUND(B774*0.25,0)","v":65}]
[null,{"$f":"B774","v":260},"Lunch",{"$f":"ROUND(B774*0.3,0)","v":78}]
[null,{"$f":"B774","v":260},"Dinner",{"$f":"ROUND(B774*0.45,0)","v":117},null,{"$f":"(D775+D774+D776)","v":260},{"$f":"(D775+D774+D776)-F776","v":0}]
[null,261,"Breakfast",{"$f":"ROUND(B777*0.25,0)","v":65}]
[null,{"$f":"B777","v":261},"Lunch",{"$f":"ROUND(B777*0.3,0)","v":78}]
[null,{"$f":"B777","v":261},"Dinner",{"$f":"ROUND(B777*0.45,0)","v":117},null,{"$f":"(D778+D777+D779)","v":260},{"$f":"(D778+D777+D779)-F779","v":0}]
[null,262,"Breakfast",{"$f":"ROUND(B780*0.25,0)","v":66}]
[null,{"$f":"B780","v":262},"Lunch",{"$f":"ROUND(B780*0.3,0)","v":79}]
[null,{"$f":"B780","v":262},"Dinner",{"$f":"ROUND(B780*0.45,0)","v":118},null,{"$f":"(D781+D780+D782)","v":263},{"$f":"(D781+D780+D782)-F782","v":0}]
[null,263,"Breakfast",{"$f":"ROUND(B783*0.25,0)","v":66}]
[null,{"$f":"B783","v":263},"Lunch",{"$f":"ROUND(B783*0.3,0)","v":79}]
[null,{"$f":"B783","v":263},"Dinner",{"$f":"ROUND(B783*0.45,0)","v":118},null,{"$f":"(D784+D783+D785)","v":263},{"$f":"(D784+D783+D785)-F785","v":0}]
[null,264,"Breakfast",{"$f":"ROUND(B786*0.25,0)","v":66}]
[null,{"$f":"B786","v":264},"Lunch",{"$f":"ROUND(B786*0.3,0)","v":79}]
[null,{"$f":"B786","v":264},"Dinner",{"$f":"ROUND(B786*0.45,0)","v":119},null,{"$f":"(D787+D786+D788)","v":264},{"$f":"(D787+D786+D788)-F788","v":0}]
[null,265,"Breakfast",{"$f":"ROUND(B789*0.25,0)","v":66}]
[null,{"$f":"B789","v":265},"Lunch",{"$f":"ROUND(B789*0.3,0)","v":80}]
[null,{"$f":"B789","v":265},"Dinner",{"$f":"ROUND(B789*0.45,0)","v":119},null,{"$f":"(D790+D789+D791)","v":265},{"$f":"(D790+D789+D791)-F791","v":0}]
[null,266,"Breakfast",{"$f":"ROUND(B792*0.25,0)","v":67}]
[null,{"$f":"B792","v":266},"Lunch",{"$f":"ROUND(B792*0.3,0)","v":80}]
[null,{"$f":"B792","v":266},"Dinner",{"$f":"ROUND(B792*0.45,0)","v":120},null,{"$f":"(D793+D792+D794)","v":267},{"$f":"(D793+D792+D794)-F794","v":0}]
[null,267,"Breakfast",{"$f":"ROUND(B795*0.25,0)","v":67}]
[null,{"$f":"B795","v":267},"Lunch",{"$f":"ROUND(B795*0.3,0)","v":80}]
[null,{"$f":"B795","v":267},"Dinner",{"$f":"ROUND(B795*0.45,0)","v":120},null,{"$f":"(D796+D795+D797)","v":267},{"$f":"(D796+D795+D797)-F797","v":0}]
[null,268,"Breakfast",{"$f":"ROUND(B798*0.25,0)","v":67}]
[null,{"$f":"B798","v":268},"Lunch",{"$f":"ROUND(B798*0.3,0)","v":80}]
[null,{"$f":"B798","v":268},"Dinner",{"$f":"ROUND(B798*0.45,0)","v":121},null,{"$f":"(D799+D798+D800)","v":268},{"$f":"(D799+D798+D800)-F800","v":0}]
[null,269,"Breakfast",{"$f":"ROUND(B801*0.25,0)","v":67}]
[null,{"$f":"B801","v":269},"Lunch",{"$f":"ROUND(B801*0.3,0)","v":81}]
[null,{"$f":"B801","v":269},"Dinner",{"$f":"ROUND(B801*0.45,0)","v":121},null,{"$f":"(D802+D801+D803)","v":269},{"$f":"(D802+D801+D803)-F803","v":0}]
[null,270,"Breakfast",{"$f":"ROUND(B804*0.25,0)","v":68}]
[null,{"$f":"B804","v":270},"Lunch",{"$f":"ROUND(B804*0.3,0)","v":81}]
[null,{"$f":"B804","v":270},"Dinner",{"$f":"ROUND(B804*0.45,0)","v":122},null,{"$f":"(D805+D804+D806)","v":271},{"$f":"(D805+D804+D806)-F806","v":0}]
[null,271,"Breakfast",{"$f":"ROUND(B807*0.25,0)","v":68}]
[null,{"$f":"B807","v":271},"Lunch",{"$f":"ROUND(B807*0.3,0)","v":81}]
[null,{"$f":"B807","v":271},"Dinner",{"$f":"ROUND(B807*0.45,0)","v":122},null,{"$f":"(D808+D807+D809)","v":271},{"$f":"(D808+D807+D809)-F809","v":0}]
[null,272,"Breakfast",{"$f":"ROUND(B810*0.25,0)","v":68}]
[null,{"$f":"B810","v":272},"Lunch",{"$f":"ROUND(B810*0.3,0)","v":82}]
[null,{"$f":"B810","v":272},"Dinner",{"$f":"ROUND(B810*0.45,0)","v":122},null,{"$f":"(D811+D810+D812)","v":272},{"$f":"(D811+D810+D812)-F812","v":0}]
[null,273,"Breakfast",{"$f":"ROUND(B813*0.25,0)","v":68}]
[null,{"$f":"B813","v":273},"Lunch",{"$f":"ROUND(B813*0.3,0)","v":82}]
[null,{"$f":"B813","v":273},"Dinner",{"$f":"ROUND(B813*0.45,0)","v":123},null,{"$f":"(D814+D813+D815)","v":273},{"$f":"(D814+D813+D815)-F815","v":0}]
[null,274,"Breakfast",{"$f":"ROUND(B816*0.25,0)","v":69}]
[null,{"$f":"B816","v":274},"Lunch",{"$f":"ROUND(B816*0.3,0)","v":82}]
[null,{"$f":"B816","v":274},"Dinner",{"$f":"ROUND(B816*0.45,0)","v":123},null,{"$f":"(D817+D816+D818)","v":274},{"$f":"(D817+D816+D818)-F818","v":0}]
[null,275,"Breakfast",{"$f":"ROUND(B819*0.25,0)","v":69}]
[null,{"$f":"B819","v":275},"Lunch",{"$f":"ROUND(B819*0.3,0)","v":83}]
[null,{"$f":"B819","v":275},"Dinner",{"$f":"ROUND(B819*0.45,0)","v":124},null,{"$f":"(D820+D819+D821)","v":276},{"$f":"(D820+D819+D821)-F821","v":0}]
[null,276,"Breakfast",{"$f":"ROUND(B822*0.25,0)","v":69}]
[null,{"$f":"B822","v":276},"Lunch",{"$f":"ROUND(B822*0.3,0)","v":83}]
[null,{"$f":"B822","v":276},"Dinner",{"$f":"ROUND(B822*0.45,0)","v":124},null,{"$f":"(D823+D822+D824)","v":276},{"$f":"(D823+D822+D824)-F824","v":0}]
[null,277,"Breakfast",{"$f":"ROUND(B825*0.25,0)","v":69}]
[null,{"$f":"B825","v":277},"Lunch",{"$f":"ROUND(B825*0.3,0)","v":83}]
[null,{"$f":"B825","v":277},"Dinner",{"$f":"ROUND(B825*0.45,0)","v":125},null,{"$f":"(D826+D825+D827)","v":277},{"$f":"(D826+D825+D827)-F827","v":0}]
[null,278,"Breakfast",{"$f":"ROUND(B828*0.25,0)","v":70}]
[null,{"$f":"B828","v":278},"Lunch",{"$f":"ROUND(B828*0.3,0)","v":83}]
[null,{"$f":"B828","v":278},"Dinner",{"$f":"ROUND(B828*0.45,0)","v":125},null,{"$f":"(D829+D828+D830)","v":278},{"$f":"(D829+D828+D830)-F830","v":0}]
[null,279,"Breakfast",{"$f":"ROUND(B831*0.25,0)","v":70}]
[null,{"$f":"B831","v":279},"Lunch",{"$f":"ROUND(B831*0.3,0)","v":84}]
[null,{"$f":"B831","v":279},"Dinner",{"$f":"ROUND(B831*0.45,0)","v":126},null,{"$f":"(D832+D831+D833)","v":280},{"$f":"(D832+D831+D833)-F833","v":0}]
[null,280,"Breakfast",{"$f":"ROUND(B834*0.25,0)","v":70}]
[null,{"$f":"B834","v":280},"Lunch",{"$f":"ROUND(B834*0.3,0)","v":84}]
[null,{"$f":"B834","v":280},"Dinner",{"$f":"ROUND(B834*0.45,0)","v":126},null,{"$f":"(D835+D834+D836)","v":280},{"$f":"(D835+D834+D836)-F836","v":0}]
[null,281,"Breakfast",{"$f":"ROUND(B837*0.25,0)","v":70}]
[null,{"$f":"B837","v":281},"Lunch",{"$f":"ROUND(B837*0.3,0)","v":84}]
[null,{"$f":"B837","v":281},"Dinner",{"$f":"ROUND(B837*0.45,0)","v":126},null,{"$f":"(D838+D837+D839)","v":280},{"$f":"(D838+D837+D839)-F839","v":0}]
[null,282,"Breakfast",{"$f":"ROUND(B840*0.25,0)","v":71}]
[null,{"$f":"B840","v":282},"Lunch",{"$f":"ROUND(B840*0.3,0)","v":85}]
[null,{"$f":"B840","v":282},"Dinner",{"$f":"ROUND(B840*0.45,0)","v":127},null,{"$f":"(D841+D840+D842)","v":283},{"$f":"(D841+D840+D842)-F842","v":0}]
[null,283,"Breakfast",{"$f":"ROUND(B843*0.25,0)","v":71}]
[null,{"$f":"B843","v":283},"Lunch",{"$f":"ROUND(B843*0.3,0)","v":85}]
[null,{"$f":"B843","v":283},"Dinner",{"$f":"ROUND(B843*0.45,0)","v":127},null,{"$f":"(D844+D843+D845)","v":283},{"$f":"(D844+D843+D845)-F845","v":0}]
[null,284,"Breakfast",{"$f":"ROUND(B846*0.25,0)","v":71}]
[null,{"$f":"B846","v":284},"Lunch",{"$f":"ROUND(B846*0.3,0)","v":85}]
[null,{"$f":"B846","v":284},"Dinner",{"$f":"ROUND(B846*0.45,0)","v":128},null,{"$f":"(D847+D846+D848)","v":284},{"$f":"(D847+D846+D848)-F848","v":0}]
[null,285,"Breakfast",{"$f":"ROUND(B849*0.25,0)","v":71}]
[null,{"$f":"B849","v":285},"Lunch",{"$f":"ROUND(B849*0.3,0)","v":86}]
[null,{"$f":"B849","v":285},"Dinner",{"$f":"ROUND(B849*0.45,0)","v":128},null,{"$f":"(D850+D849+D851)","v":285},{"$f":"(D850+D849+D851)-F851","v":0}]
[null,286,"Breakfast",{"$f":"ROUND(B852*0.25,0)","v":72}]
[null,{"$f":"B852","v":286},"Lunch",{"$f":"ROUND(B852*0.3,0)","v":86}]
[null,{"$f":"B852","v":286},"Dinner",{"$f":"ROUND(B852*0.45,0)","v":129},null,{"$f":"(D853+D852+D854)","v":287},{"$f":"(D853+D852+D854)-F854","v":0}]
[null,287,"Breakfast",{"$f":"ROUND(B855*0.25,0)","v":72}]
[null,{"$f":"B855","v":287},"Lunch",{"$f":"ROUND(B855*0.3,0)","v":86}]
[null,{"$f":"B855","v":287},"Dinner",{"$f":"ROUND(B855*0.45,0)","v":129},null,{"$f":"(D856+D855+D857)","v":287},{"$f":"(D856+D855+D857)-F857","v":0}]
[null,288,"Breakfast",{"$f":"ROUND(B858*0.25,0)","v":72}]
[null,{"$f":"B858","v":288},"Lunch",{"$f":"ROUND(B858*0.3,0)","v":86}]
[null,{"$f":"B858","v":288},"Dinner",{"$f":"ROUND(B858*0.45,0)","v":130},null,{"$f":"(D859+D858+D860)","v":288},{"$f":"(D859+D858+D860)-F860","v":0}]
[null,289,"Breakfast",{"$f":"ROUND(B861*0.25,0)","v":72}]
[null,{"$f":"B861","v":289},"Lunch",{"$f":"ROUND(B861*0.3,0)","v":87}]
[null,{"$f":"B861","v":289},"Dinner",{"$f":"ROUND(B861*0.45,0)","v":130},null,{"$f":"(D862+D861+D863)","v":289},{"$f":"(D862+D861+D863)-F863","v":0}]
[null,290,"Breakfast",{"$f":"ROUND(B864*0.25,0)","v":73}]
[null,{"$f":"B864","v":290},"Lunch",{"$f":"ROUND(B864*0.3,0)","v":87}]
[null,{"$f":"B864","v":290},"Dinner",{"$f":"ROUND(B864*0.45,0)","v":131},null,{"$f":"(D865+D864+D866)","v":291},{"$f":"(D865+D864+D866)-F866","v":0}]
[null,291,"Breakfast",{"$f":"ROUND(B867*0.25,0)","v":73}]
[null,{"$f":"B867","v":291},"Lunch",{"$f":"ROUND(B867*0.3,0)","v":87}]
[null,{"$f":"B867","v":291},"Dinner",{"$f":"ROUND(B867*0.45,0)","v":131},null,{"$f":"(D868+D867+D869)","v":291},{"$f":"(D868+D867+D869)-F869","v":0}]
[null,292,"Breakfast",{"$f":"ROUND(B870*0.25,0)","v":73}]
[null,{"$f":"B870","v":292},"Lunch",{"$f":"ROUND(B870*0.3,0)","v":88}]
[null,{"$f":"B870","v":292},"Dinner",{"$f":"ROUND(B870*0.45,0)","v":131},null,{"$f":"(D871+D870+D872)","v":292},{"$f":"(D871+D870+D872)-F872","v":0}]
[null,293,"Breakfast",{"$f":"ROUND(B873*0.25,0)","v":73}]
[null,{"$f":"B873","v":293},"Lunch",{"$f":"ROUND(B873*0.3,0)","v":88}]
[null,{"$f":"B873","v":293},"Dinner",{"$f":"ROUND(B873*0.45,0)","v":132},null,{"$f":"(D874+D873+D875)","v":293},{"$f":"(D874+D873+D875)-F875","v":0}]
[null,294,"Breakfast",{"$f":"ROUND(B876*0.25,0)","v":74}]
[null,{"$f":"B876","v":294},"Lunch",{"$f":"ROUND(B876*0.3,0)","v":88}]
[null,{"$f":"B876","v":294},"Dinner",{"$f":"ROUND(B876*0.45,0)","v":132},null,{"$f":"(D877+D876+D878)","v":294},{"$f":"(D877+D876+D878)-F878","v":0}]
[null,295,"Breakfast",{"$f":"ROUND(B879*0.25,0)","v":74}]
[null,{"$f":"B879","v":295},"Lunch",{"$f":"ROUND(B879*0.3,0)","v":89}]
[null,{"$f":"B879","v":295},"Dinner",{"$f":"ROUND(B879*0.45,0)","v":133},null,{"$f":"(D880+D879+D881)","v":296},{"$f":"(D880+D879+D881)-F881","v":0}]
[null,296,"Breakfast",{"$f":"ROUND(B882*0.25,0)","v":74}]
[null,{"$f":"B882","v":296},"Lunch",{"$f":"ROUND(B882*0.3,0)","v":89}]
[null,{"$f":"B882","v":296},"Dinner",{"$f":"ROUND(B882*0.45,0)","v":133},null,{"$f":"(D883+D882+D884)","v":296},{"$f":"(D883+D882+D884)-F884","v":0}]
[null,297,"Breakfast",{"$f":"ROUND(B885*0.25,0)","v":74}]
[null,{"$f":"B885","v":297},"Lunch",{"$f":"ROUND(B885*0.3,0)","v":89}]
[null,{"$f":"B885","v":297},"Dinner",{"$f":"ROUND(B885*0.45,0)","v":134},null,{"$f":"(D886+D885+D887)","v":297},{"$f":"(D886+D885+D887)-F887","v":0}]
[null,298,"Breakfast",{"$f":"ROUND(B888*0.25,0)","v":75}]
[null,{"$f":"B888","v":298},"Lunch",{"$f":"ROUND(B888*0.3,0)","v":89}]
[null,{"$f":"B888","v":298},"Dinner",{"$f":"ROUND(B888*0.45,0)","v":134},null,{"$f":"(D889+D888+D890)","v":298},{"$f":"(D889+D888+D890)-F890","v":0}]
[null,299,"Breakfast",{"$f":"ROUND(B891*0.25,0)","v":75}]
[null,{"$f":"B891","v":299},"Lunch",{"$f":"ROUND(B891*0.3,0)","v":90}]
[null,{"$f":"B891","v":299},"Dinner",{"$f":"ROUND(B891*0.45,0)","v":135},null,{"$f":"(D892+D891+D893)","v":300},{"$f":"(D892+D891+D893)-F893","v":0}]
[null,300,"Breakfast",{"$f":"ROUND(B894*0.25,0)","v":75}]
[null,{"$f":"B894","v":300},"Lunch",{"$f":"ROUND(B894*0.3,0)","v":90}]
[null,{"$f":"B894","v":300},"Dinner",{"$f":"ROUND(B894*0.45,0)","v":135},null,{"$f":"(D895+D894+D896)","v":300},{"$f":"(D895+D894+D896)-F896","v":0}]
[null,301,"Breakfast",{"$f":"ROUND(B897*0.25,0)","v":75}]
[null,{"$f":"B897","v":301},"Lunch",{"$f":"ROUND(B897*0.3,0)","v":90}]
[null,{"$f":"B897","v":301},"Dinner",{"$f":"ROUND(B897*0.45,0)","v":135},null,{"$f":"(D898+D897+D899)","v":300},{"$f":"(D898+D897+D899)-F899","v":0}]
[null,302,"Breakfast",{"$f":"ROUND(B900*0.25,0)","v":76}]
[null,{"$f":"B900","v":302},"Lunch",{"$f":"ROUND(B900*0.3,0)","v":91}]
[null,{"$f":"B900","v":302},"Dinner",{"$f":"ROUND(B900*0.45,0)","v":136},null,{"$f":"(D901+D900+D902)","v":303},{"$f":"(D901+D900+D902)-F902","v":0}]
[null,303,"Breakfast",{"$f":"ROUND(B903*0.25,0)","v":76}]
[null,{"$f":"B903","v":303},"Lunch",{"$f":"ROUND(B903*0.3,0)","v":91}]
[null,{"$f":"B903","v":303},"Dinner",{"$f":"ROUND(B903*0.45,0)","v":136},null,{"$f":"(D904+D903+D905)","v":303},{"$f":"(D904+D903+D905)-F905","v":0}]
[null,304,"Breakfast",{"$f":"ROUND(B906*0.25,0)","v":76}]
[null,{"$f":"B906","v":304},"Lunch",{"$f":"ROUND(B906*0.3,0)","v":91}]
[null,{"$f":"B906","v":304},"Dinner",{"$f":"ROUND(B906*0.45,0)","v":137},null,{"$f":"(D907+D906+D908)","v":304},{"$f":"(D907+D906+D908)-F908","v":0}]
[null,305,"Breakfast",{"$f":"ROUND(B909*0.25,0)","v":76}]
[null,{"$f":"B909","v":305},"Lunch",{"$f":"ROUND(B909*0.3,0)","v":92}]
[null,{"$f":"B909","v":305},"Dinner",{"$f":"ROUND(B909*0.45,0)","v":137},null,{"$f":"(D910+D909+D911)","v":305},{"$f":"(D910+D909+D911)-F911","v":0}]
[null,306,"Breakfast",{"$f":"ROUND(B912*0.25,0)","v":77}]
[null,{"$f":"B912","v":306},"Lunch",{"$f":"ROUND(B912*0.3,0)","v":92}]
[null,{"$f":"B912","v":306},"Dinner",{"$f":"ROUND(B912*0.45,0)","v":138},null,{"$f":"(D913+D912+D914)","v":307},{"$f":"(D913+D912+D914)-F914","v":0}]
[null,307,"Breakfast",{"$f":"ROUND(B915*0.25,0)","v":77}]
[null,{"$f":"B915","v":307},"Lunch",{"$f":"ROUND(B915*0.3,0)","v":92}]
[null,{"$f":"B915","v":307},"Dinner",{"$f":"ROUND(B915*0.45,0)","v":138},null,{"$f":"(D916+D915+D917)","v":307},{"$f":"(D916+D915+D917)-F917","v":0}]
[null,308,"Breakfast",{"$f":"ROUND(B918*0.25,0)","v":77}]
[null,{"$f":"B918","v":308},"Lunch",{"$f":"ROUND(B918*0.3,0)","v":92}]
[null,{"$f":"B918","v":308},"Dinner",{"$f":"ROUND(B918*0.45,0)","v":139},null,{"$f":"(D919+D918+D920)","v":308},{"$f":"(D919+D918+D920)-F920","v":0}]
[null,309,"Breakfast",{"$f":"ROUND(B921*0.25,0)","v":77}]
[null,{"$f":"B921","v":309},"Lunch",{"$f":"ROUND(B921*0.3,0)","v":93}]
[null,{"$f":"B921","v":309},"Dinner",{"$f":"ROUND(B921*0.45,0)","v":139},null,{"$f":"(D922+D921+D923)","v":309},{"$f":"(D922+D921+D923)-F923","v":0}]
[null,310,"Breakfast",{"$f":"ROUND(B924*0.25,0)","v":78}]
[null,{"$f":"B924","v":310},"Lunch",{"$f":"ROUND(B924*0.3,0)","v":93}]
[null,{"$f":"B924","v":310},"Dinner",{"$f":"ROUND(B924*0.45,0)","v":140},null,{"$f":"(D925+D924+D926)","v":311},{"$f":"(D925+D924+D926)-F926","v":0}]
[null,311,"Breakfast",{"$f":"ROUND(B927*0.25,0)","v":78}]
[null,{"$f":"B927","v":311},"Lunch",{"$f":"ROUND(B927*0.3,0)","v":93}]
[null,{"$f":"B927","v":311},"Dinner",{"$f":"ROUND(B927*0.45,0)","v":140},null,{"$f":"(D928+D927+D929)","v":311},{"$f":"(D928+D927+D929)-F929","v":0}]
[null,312,"Breakfast",{"$f":"ROUND(B930*0.25,0)","v":78}]
[null,{"$f":"B930","v":312},"Lunch",{"$f":"ROUND(B930*0.3,0)","v":94}]
[null,{"$f":"B930","v":312},"Dinner",{"$f":"ROUND(B930*0.45,0)","v":140},null,{"$f":"(D931+D930+D932)","v":312},{"$f":"(D931+D930+D932)-F932","v":0}]
[null,313,"Breakfast",{"$f":"ROUND(B933*0.25,0)","v":78}]
[null,{"$f":"B933","v":313},"Lunch",{"$f":"ROUND(B933*0.3,0)","v":94}]
[null,{"$f":"B933","v":313},"Dinner",{"$f":"ROUND(B933*0.45,0)","v":141},null,{"$f":"(D934+D933+D935)","v":313},{"$f":"(D934+D933+D935)-F935","v":0}]
[null,314,"Breakfast",{"$f":"ROUND(B936*0.25,0)","v":79}]
[null,{"$f":"B936","v":314},"Lunch",{"$f":"ROUND(B936*0.3,0)","v":94}]
[null,{"$f":"B936","v":314},"Dinner",{"$f":"ROUND(B936*0.45,0)","v":141},null,{"$f":"(D937+D936+D938)","v":314},{"$f":"(D937+D936+D938)-F938","v":0}]
[null,315,"Breakfast",{"$f":"ROUND(B939*0.25,0)","v":79}]
[null,{"$f":"B939","v":315},"Lunch",{"$f":"ROUND(B939*0.3,0)","v":95}]
[null,{"$f":"B939","v":315},"Dinner",{"$f":"ROUND(B939*0.45,0)","v":142},null,{"$f":"(D940+D939+D941)","v":316},{"$f":"(D940+D939+D941)-F941","v":0}]
[null,316,"Breakfast",{"$f":"ROUND(B942*0.25,0)","v":79}]
[null,{"$f":"B942","v":316},"Lunch",{"$f":"ROUND(B942*0.3,0)","v":95}]
[null,{"$f":"B942","v":316},"Dinner",{"$f":"ROUND(B942*0.45,0)","v":142},null,{"$f":"(D943+D942+D944)","v":316},{"$f":"(D943+D942+D944)-F944","v":0}]
[null,317,"Breakfast",{"$f":"ROUND(B945*0.25,0)","v":79}]
[null,{"$f":"B945","v":317},"Lunch",{"$f":"ROUND(B945*0.3,0)","v":95}]
[null,{"$f":"B945","v":317},"Dinner",{"$f":"ROUND(B945*0.45,0)","v":143},null,{"$f":"(D946+D945+D947)","v":317},{"$f":"(D946+D945+D947)-F947","v":0}]
[null,318,"Breakfast",{"$f":"ROUND(B948*0.25,0)","v":80}]
[null,{"$f":"B948","v":318},"Lunch",{"$f":"ROUND(B948*0.3,0)","v":95}]
[null,{"$f":"B948","v":318},"Dinner",{"$f":"ROUND(B948*0.45,0)","v":143},null,{"$f":"(D949+D948+D950)","v":318},{"$f":"(D949+D948+D950)-F950","v":0}]
[null,319,"Breakfast",{"$f":"ROUND(B951*0.25,0)","v":80}]
[null,{"$f":"B951","v":319},"Lunch",{"$f":"ROUND(B951*0.3,0)","v":96}]
[null,{"$f":"B951","v":319},"Dinner",{"$f":"ROUND(B951*0.45,0)","v":144},null,{"$f":"(D952+D951+D953)","v":320},{"$f":"(D952+D951+D953)-F953","v":0}]
[null,320,"Breakfast",{"$f":"ROUND(B954*0.25,0)","v":80}]
[null,{"$f":"B954","v":320},"Lunch",{"$f":"ROUND(B954*0.3,0)","v":96}]
[null,{"$f":"B954","v":320},"Dinner",{"$f":"ROUND(B954*0.45,0)","v":144},null,{"$f":"(D955+D954+D956)","v":320},{"$f":"(D955+D954+D956)-F956","v":0}]
[null,321,"Breakfast",{"$f":"ROUND(B957*0.25,0)","v":80}]
[null,{"$f":"B957","v":321},"Lunch",{"$f":"ROUND(B957*0.3,0)","v":96}]
[null,{"$f":"B957","v":321},"Dinner",{"$f":"ROUND(B957*0.45,0)","v":144},null,{"$f":"(D958+D957+D959)","v":320},{"$f":"(D958+D957+D959)-F959","v":0}]
[null,322,"Breakfast",{"$f":"ROUND(B960*0.25,0)","v":81}]
[null,{"$f":"B960","v":322},"Lunch",{"$f":"ROUND(B960*0.3,0)","v":97}]
[null,{"$f":"B960","v":322},"Dinner",{"$f":"ROUND(B960*0.45,0)","v":145},null,{"$f":"(D961+D960+D962)","v":323},{"$f":"(D961+D960+D962)-F962","v":0}]
[null,323,"Breakfast",{"$f":"ROUND(B963*0.25,0)","v":81}]
[null,{"$f":"B963","v":323},"Lunch",{"$f":"ROUND(B963*0.3,0)","v":97}]
[null,{"$f":"B963","v":323},"Dinner",{"$f":"ROUND(B963*0.45,0)","v":145},null,{"$f":"(D964+D963+D965)","v":323},{"$f":"(D964+D963+D965)-F965","v":0}]
[null,324,"Breakfast",{"$f":"ROUND(B966*0.25,0)","v":81}]
[null,{"$f":"B966","v":324},"Lunch",{"$f":"ROUND(B966*0.3,0)","v":97}]
[null,{"$f":"B966","v":324},"Dinner",{"$f":"ROUND(B966*0.45,0)","v":146},null,{"$f":"(D967+D966+D968)","v":324},{"$f":"(D967+D966+D968)-F968","v":0}]
[null,325,"Breakfast",{"$f":"ROUND(B969*0.25,0)","v":81}]
[null,{"$f":"B969","v":325},"Lunch",{"$f":"ROUND(B969*0.3,0)","v":98}]
[null,{"$f":"B969","v":325},"Dinner",{"$f":"ROUND(B969*0.45,0)","v":146},null,{"$f":"(D970+D969+D971)","v":325},{"$f":"(D970+D969+D971)-F971","v":0}]
[null,326,"Breakfast",{"$f":"ROUND(B972*0.25,0)","v":82}]
[null,{"$f":"B972","v":326},"Lunch",{"$f":"ROUND(B972*0.3,0)","v":98}]
[null,{"$f":"B972","v":326},"Dinner",{"$f":"ROUND(B972*0.45,0)","v":147},null,{"$f":"(D973+D972+D974)","v":327},{"$f":"(D973+D972+D974)-F974","v":0}]
[null,327,"Breakfast",{"$f":"ROUND(B975*0.25,0)","v":82}]
[null,{"$f":"B975","v":327},"Lunch",{"$f":"ROUND(B975*0.3,0)","v":98}]
[null,{"$f":"B975","v":327},"Dinner",{"$f":"ROUND(B975*0.45,0)","v":147},null,{"$f":"(D976+D975+D977)","v":327},{"$f":"(D976+D975+D977)-F977","v":0}]
[null,328,"Breakfast",{"$f":"ROUND(B978*0.25,0)","v":82}]
[null,{"$f":"B978","v":328},"Lunch",{"$f":"ROUND(B978*0.3,0)","v":98}]
[null,{"$f":"B978","v":328},"Dinner",{"$f":"ROUND(B978*0.45,0)","v":148},null,{"$f":"(D979+D978+D980)","v":328},{"$f":"(D979+D978+D980)-F980","v":0}]
[null,329,"Breakfast",{"$f":"ROUND(B981*0.25,0)","v":82}]
[null,{"$f":"B981","v":329},"Lunch",{"$f":"ROUND(B981*0.3,0)","v":99}]
[null,{"$f":"B981","v":329},"Dinner",{"$f":"ROUND(B981*0.45,0)","v":148},null,{"$f":"(D982+D981+D983)","v":329},{"$f":"(D982+D981+D983)-F983","v":0}]
[null,330,"Breakfast",{"$f":"ROUND(B984*0.25,0)","v":83}]
[null,{"$f":"B984","v":330},"Lunch",{"$f":"ROUND(B984*0.3,0)","v":99}]
[null,{"$f":"B984","v":330},"Dinner",{"$f":"ROUND(B984*0.45,0)","v":149},null,{"$f":"(D985+D984+D986)","v":331},{"$f":"(D985+D984+D986)-F986","v":0}]
[null,331,"Breakfast",{"$f":"ROUND(B987*0.25,0)","v":83}]
[null,{"$f":"B987","v":331},"Lunch",{"$f":"ROUND(B987*0.3,0)","v":99}]
[null,{"$f":"B987","v":331},"Dinner",{"$f":"ROUND(B987*0.45,0)","v":149},null,{"$f":"(D988+D987+D989)","v":331},{"$f":"(D988+D987+D989)-F989","v":0}]
[null,332,"Breakfast",{"$f":"ROUND(B990*0.25,0)","v":83}]
[null,{"$f":"B990","v":332},"Lunch",{"$f":"ROUND(B990*0.3,0)","v":100}]
[null,{"$f":"B990","v":332},"Dinner",{"$f":"ROUND(B990*0.45,0)","v":149},null,{"$f":"(D991+D990+D992)","v":332},{"$f":"(D991+D990+D992)-F992","v":0}]
[null,333,"Breakfast",{"$f":"ROUND(B993*0.25,0)","v":83}]
[null,{"$f":"B993","v":333},"Lunch",{"$f":"ROUND(B993*0.3,0)","v":100}]
[null,{"$f":"B993","v":333},"Dinner",{"$f":"ROUND(B993*0.45,0)","v":150},null,{"$f":"(D994+D993+D995)","v":333},{"$f":"(D994+D993+D995)-F995","v":0}]
[null,334,"Breakfast",{"$f":"ROUND(B996*0.25,0)","v":84}]
[null,{"$f":"B996","v":334},"Lunch",{"$f":"ROUND(B996*0.3,0)","v":100}]
[null,{"$f":"B996","v":334},"Dinner",{"$f":"ROUND(B996*0.45,0)","v":150},null,{"$f":"(D997+D996+D998)","v":334},{"$f":"(D997+D996+D998)-F998","v":0}]
[null,335,"Breakfast",{"$f":"ROUND(B999*0.25,0)","v":84}]
[null,{"$f":"B999","v":335},"Lunch",{"$f":"ROUND(B999*0.3,0)","v":101}]
[null,{"$f":"B999","v":335},"Dinner",{"$f":"ROUND(B999*0.45,0)","v":151},null,{"$f":"(D1000+D999+D1001)","v":336},{"$f":"(D1000+D999+D1001)-F1001","v":0}]
[null,336,"Breakfast",{"$f":"ROUND(B1002*0.25,0)","v":84}]
[null,{"$f":"B1002","v":336},"Lunch",{"$f":"ROUND(B1002*0.3,0)","v":101}]
[null,{"$f":"B1002","v":336},"Dinner",{"$f":"ROUND(B1002*0.45,0)","v":151},null,{"$f":"(D1003+D1002+D1004)","v":336},{"$f":"(D1003+D1002+D1004)-F1004","v":0}]
[null,337,"Breakfast",{"$f":"ROUND(B1005*0.25,0)","v":84}]
[null,{"$f":"B1005","v":337},"Lunch",{"$f":"ROUND(B1005*0.3,0)","v":101}]
[null,{"$f":"B1005","v":337},"Dinner",{"$f":"ROUND(B1005*0.45,0)","v":152},null,{"$f":"(D1006+D1005+D1007)","v":337},{"$f":"(D1006+D1005+D1007)-F1007","v":0}]
[null,338,"Breakfast",{"$f":"ROUND(B1008*0.25,0)","v":85}]
[null,{"$f":"B1008","v":338},"Lunch",{"$f":"ROUND(B1008*0.3,0)","v":101}]
[null,{"$f":"B1008","v":338},"Dinner",{"$f":"ROUND(B1008*0.45,0)","v":152},null,{"$f":"(D1009+D1008+D1010)","v":338},{"$f":"(D1009+D1008+D1010)-F1010","v":0}]
[null,339,"Breakfast",{"$f":"ROUND(B1011*0.25,0)","v":85}]
[null,{"$f":"B1011","v":339},"Lunch",{"$f":"ROUND(B1011*0.3,0)","v":102}]
[null,{"$f":"B1011","v":339},"Dinner",{"$f":"ROUND(B1011*0.45,0)","v":153},null,{"$f":"(D1012+D1011+D1013)","v":340},{"$f":"(D1012+D1011+D1013)-F1013","v":0}]
[null,340,"Breakfast",{"$f":"ROUND(B1014*0.25,0)","v":85}]
[null,{"$f":"B1014","v":340},"Lunch",{"$f":"ROUND(B1014*0.3,0)","v":102}]
[null,{"$f":"B1014","v":340},"Dinner",{"$f":"ROUND(B1014*0.45,0)","v":153},null,{"$f":"(D1015+D1014+D1016)","v":340},{"$f":"(D1015+D1014+D1016)-F1016","v":0}]
[null,341,"Breakfast",{"$f":"ROUND(B1017*0.25,0)","v":85}]
[null,{"$f":"B1017","v":341},"Lunch",{"$f":"ROUND(B1017*0.3,0)","v":102}]
[null,{"$f":"B1017","v":341},"Dinner",{"$f":"ROUND(B1017*0.45,0)","v":153},null,{"$f":"(D1018+D1017+D1019)","v":340},{"$f":"(D1018+D1017+D1019)-F1019","v":0}]
[null,342,"Breakfast",{"$f":"ROUND(B1020*0.25,0)","v":86}]
[null,{"$f":"B1020","v":342},"Lunch",{"$f":"ROUND(B1020*0.3,0)","v":103}]
[null,{"$f":"B1020","v":342},"Dinner",{"$f":"ROUND(B1020*0.45,0)","v":154},null,{"$f":"(D1021+D1020+D1022)","v":343},{"$f":"(D1021+D1020+D1022)-F1022","v":0}]
[null,343,"Breakfast",{"$f":"ROUND(B1023*0.25,0)","v":86}]
[null,{"$f":"B1023","v":343},"Lunch",{"$f":"ROUND(B1023*0.3,0)","v":103}]
[null,{"$f":"B1023","v":343},"Dinner",{"$f":"ROUND(B1023*0.45,0)","v":154},null,{"$f":"(D1024+D1023+D1025)","v":343},{"$f":"(D1024+D1023+D1025)-F1025","v":0}]
[null,344,"Breakfast",{"$f":"ROUND(B1026*0.25,0)","v":86}]
[null,{"$f":"B1026","v":344},"Lunch",{"$f":"ROUND(B1026*0.3,0)","v":103}]
[null,{"$f":"B1026","v":344},"Dinner",{"$f":"ROUND(B1026*0.45,0)","v":155},null,{"$f":"(D1027+D1026+D1028)","v":344},{"$f":"(D1027+D1026+D1028)-F1028","v":0}]
[null,345,"Breakfast",{"$f":"ROUND(B1029*0.25,0)","v":86}]
[null,{"$f":"B1029","v":345},"Lunch",{"$f":"ROUND(B1029*0.3,0)","v":104}]
[null,{"$f":"B1029","v":345},"Dinner",{"$f":"ROUND(B1029*0.45,0)","v":155},null,{"$f":"(D1030+D1029+D1031)","v":345},{"$f":"(D1030+D1029+D1031)-F1031","v":0}]
[null,346,"Breakfast",{"$f":"ROUND(B1032*0.25,0)","v":87}]
[null,{"$f":"B1032","v":346},"Lunch",{"$f":"ROUND(B1032*0.3,0)","v":104}]
[null,{"$f":"B1032","v":346},"Dinner",{"$f":"ROUND(B1032*0.45,0)","v":156},null,{"$f":"(D1033+D1032+D1034)","v":347},{"$f":"(D1033+D1032+D1034)-F1034","v":0}]
[null,347,"Breakfast",{"$f":"ROUND(B1035*0.25,0)","v":87}]
[null,{"$f":"B1035","v":347},"Lunch",{"$f":"ROUND(B1035*0.3,0)","v":104}]
[null,{"$f":"B1035","v":347},"Dinner",{"$f":"ROUND(B1035*0.45,0)","v":156},null,{"$f":"(D1036+D1035+D1037)","v":347},{"$f":"(D1036+D1035+D1037)-F1037","v":0}]
[null,348,"Breakfast",{"$f":"ROUND(B1038*0.25,0)","v":87}]
[null,{"$f":"B1038","v":348},"Lunch",{"$f":"ROUND(B1038*0.3,0)","v":104}]
[null,{"$f":"B1038","v":348},"Dinner",{"$f":"ROUND(B1038*0.45,0)","v":157},null,{"$f":"(D1039+D1038+D1040)","v":348},{"$f":"(D1039+D1038+D1040)-F1040","v":0}]
[null,349,"Breakfast",{"$f":"ROUND(B1041*0.25,0)","v":87}]
[null,{"$f":"B1041","v":349},"Lunch",{"$f":"ROUND(B1041*0.3,0)","v":105}]
[null,{"$f":"B1041","v":349},"Dinner",{"$f":"ROUND(B1041*0.45,0)","v":157},null,{"$f":"(D1042+D1041+D1043)","v":349},{"$f":"(D1042+D1041+D1043)-F1043","v":0}]
[null,350,"Breakfast",{"$f":"ROUND(B1044*0.25,0)","v":88}]
[null,{"$f":"B1044","v":350},"Lunch",{"$f":"ROUND(B1044*0.3,0)","v":105}]
[null,{"$f":"B1044","v":350},"Dinner",{"$f":"ROUND(B1044*0.45,0)","v":158},null,{"$f":"(D1045+D1044+D1046)","v":351},{"$f":"(D1045+D1044+D1046)-F1046","v":0}]
[null,351,"Breakfast",{"$f":"ROUND(B1047*0.25,0)","v":88}]
[null,{"$f":"B1047","v":351},"Lunch",{"$f":"ROUND(B1047*0.3,0)","v":105}]
[null,{"$f":"B1047","v":351},"Dinner",{"$f":"ROUND(B1047*0.45,0)","v":158},null,{"$f":"(D1048+D1047+D1049)","v":351},{"$f":"(D1048+D1047+D1049)-F1049","v":0}]
[null,352,"Breakfast",{"$f":"ROUND(B1050*0.25,0)","v":88}]
[null,{"$f":"B1050","v":352},"Lunch",{"$f":"ROUND(B1050*0.3,0)","v":106}]
[null,{"$f":"B1050","v":352},"Dinner",{"$f":"ROUND(B1050*0.45,0)","v":158},null,{"$f":"(D1051+D1050+D1052)","v":352},{"$f":"(D1051+D1050+D1052)-F1052","v":0}]
[null,353,"Breakfast",{"$f":"ROUND(B1053*0.25,0)","v":88}]
[null,{"$f":"B1053","v":353},"Lunch",{"$f":"ROUND(B1053*0.3,0)","v":106}]
[null,{"$f":"B1053","v":353},"Dinner",{"$f":"ROUND(B1053*0.45,0)","v":159},null,{"$f":"(D1054+D1053+D1055)","v":353},{"$f":"(D1054+D1053+D1055)-F1055","v":0}]
[null,354,"Breakfast",{"$f":"ROUND(B1056*0.25,0)","v":89}]
[null,{"$f":"B1056","v":354},"Lunch",{"$f":"ROUND(B1056*0.3,0)","v":106}]
[null,{"$f":"B1056","v":354},"Dinner",{"$f":"ROUND(B1056*0.45,0)","v":159},null,{"$f":"(D1057+D1056+D1058)","v":354},{"$f":"(D1057+D1056+D1058)-F1058","v":0}]
[null,355,"Breakfast",{"$f":"ROUND(B1059*0.25,0)","v":89}]
[null,{"$f":"B1059","v":355},"Lunch",{"$f":"ROUND(B1059*0.3,0)","v":107}]
[null,{"$f":"B1059","v":355},"Dinner",{"$f":"ROUND(B1059*0.45,0)","v":160},null,{"$f":"(D1060+D1059+D1061)","v":356},{"$f":"(D1060+D1059+D1061)-F1061","v":0}]
[null,356,"Breakfast",{"$f":"ROUND(B1062*0.25,0)","v":89}]
[null,{"$f":"B1062","v":356},"Lunch",{"$f":"ROUND(B1062*0.3,0)","v":107}]
[null,{"$f":"B1062","v":356},"Dinner",{"$f":"ROUND(B1062*0.45,0)","v":160},null,{"$f":"(D1063+D1062+D1064)","v":356},{"$f":"(D1063+D1062+D1064)-F1064","v":0}]
[null,357,"Breakfast",{"$f":"ROUND(B1065*0.25,0)","v":89}]
[null,{"$f":"B1065","v":357},"Lunch",{"$f":"ROUND(B1065*0.3,0)","v":107}]
[null,{"$f":"B1065","v":357},"Dinner",{"$f":"ROUND(B1065*0.45,0)","v":161},null,{"$f":"(D1066+D1065+D1067)","v":357},{"$f":"(D1066+D1065+D1067)-F1067","v":0}]
[null,358,"Breakfast",{"$f":"ROUND(B1068*0.25,0)","v":90}]
[null,{"$f":"B1068","v":358},"Lunch",{"$f":"ROUND(B1068*0.3,0)","v":107}]
[null,{"$f":"B1068","v":358},"Dinner",{"$f":"ROUND(B1068*0.45,0)","v":161},null,{"$f":"(D1069+D1068+D1070)","v":358},{"$f":"(D1069+D1068+D1070)-F1070","v":0}]
[null,359,"Breakfast",{"$f":"ROUND(B1071*0.25,0)","v":90}]
[null,{"$f":"B1071","v":359},"Lunch",{"$f":"ROUND(B1071*0.3,0)","v":108}]
[null,{"$f":"B1071","v":359},"Dinner",{"$f":"ROUND(B1071*0.45,0)","v":162},null,{"$f":"(D1072+D1071+D1073)","v":360},{"$f":"(D1072+D1071+D1073)-F1073","v":0}]
[null,360,"Breakfast",{"$f":"ROUND(B1074*0.25,0)","v":90}]
[null,{"$f":"B1074","v":360},"Lunch",{"$f":"ROUND(B1074*0.3,0)","v":108}]
[null,{"$f":"B1074","v":360},"Dinner",{"$f":"ROUND(B1074*0.45,0)","v":162},null,{"$f":"(D1075+D1074+D1076)","v":360},{"$f":"(D1075+D1074+D1076)-F1076","v":0}]
[null,361,"Breakfast",{"$f":"ROUND(B1077*0.25,0)","v":90}]
[null,{"$f":"B1077","v":361},"Lunch",{"$f":"ROUND(B1077*0.3,0)","v":108}]
[null,{"$f":"B1077","v":361},"Dinner",{"$f":"ROUND(B1077*0.45,0)","v":162},null,{"$f":"(D1078+D1077+D1079)","v":360},{"$f":"(D1078+D1077+D1079)-F1079","v":0}]
[null,362,"Breakfast",{"$f":"ROUND(B1080*0.25,0)","v":91}]
[null,{"$f":"B1080","v":362},"Lunch",{"$f":"ROUND(B1080*0.3,0)","v":109}]
[null,{"$f":"B1080","v":362},"Dinner",{"$f":"ROUND(B1080*0.45,0)","v":163},null,{"$f":"(D1081+D1080+D1082)","v":363},{"$f":"(D1081+D1080+D1082)-F1082","v":0}]
[null,363,"Breakfast",{"$f":"ROUND(B1083*0.25,0)","v":91}]
[null,{"$f":"B1083","v":363},"Lunch",{"$f":"ROUND(B1083*0.3,0)","v":109}]
[null,{"$f":"B1083","v":363},"Dinner",{"$f":"ROUND(B1083*0.45,0)","v":163},null,{"$f":"(D1084+D1083+D1085)","v":363},{"$f":"(D1084+D1083+D1085)-F1085","v":0}]
[null,364,"Breakfast",{"$f":"ROUND(B1086*0.25,0)","v":91}]
[null,{"$f":"B1086","v":364},"Lunch",{"$f":"ROUND(B1086*0.3,0)","v":109}]
[null,{"$f":"B1086","v":364},"Dinner",{"$f":"ROUND(B1086*0.45,0)","v":164},null,{"$f":"(D1087+D1086+D1088)","v":364},{"$f":"(D1087+D1086+D1088)-F1088","v":0}]
[null,365,"Breakfast",{"$f":"ROUND(B1089*0.25,0)","v":91}]
[null,{"$f":"B1089","v":365},"Lunch",{"$f":"ROUND(B1089*0.3,0)","v":110}]
[null,{"$f":"B1089","v":365},"Dinner",{"$f":"ROUND(B1089*0.45,0)","v":164},null,{"$f":"(D1090+D1089+D1091)","v":365},{"$f":"(D1090+D1089+D1091)-F1091","v":0}]
[null,366,"Breakfast",{"$f":"ROUND(B1092*0.25,0)","v":92}]
[null,{"$f":"B1092","v":366},"Lunch",{"$f":"ROUND(B1092*0.3,0)","v":110}]
[null,{"$f":"B1092","v":366},"Dinner",{"$f":"ROUND(B1092*0.45,0)","v":165},null,{"$f":"(D1093+D1092+D1094)","v":367},{"$f":"(D1093+D1092+D1094)-F1094","v":0}]
[null,367,"Breakfast",{"$f":"ROUND(B1095*0.25,0)","v":92}]
[null,{"$f":"B1095","v":367},"Lunch",{"$f":"ROUND(B1095*0.3,0)","v":110}]
[null,{"$f":"B1095","v":367},"Dinner",{"$f":"ROUND(B1095*0.45,0)","v":165},null,{"$f":"(D1096+D1095+D1097)","v":367},{"$f":"(D1096+D1095+D1097)-F1097","v":0}]
[null,368,"Breakfast",{"$f":"ROUND(B1098*0.25,0)","v":92}]
[null,{"$f":"B1098","v":368},"Lunch",{"$f":"ROUND(B1098*0.3,0)","v":110}]
[null,{"$f":"B1098","v":368},"Dinner",{"$f":"ROUND(B1098*0.45,0)","v":166},null,{"$f":"(D1099+D1098+D1100)","v":368},{"$f":"(D1099+D1098+D1100)-F1100","v":0}]
[null,369,"Breakfast",{"$f":"ROUND(B1101*0.25,0)","v":92}]
[null,{"$f":"B1101","v":369},"Lunch",{"$f":"ROUND(B1101*0.3,0)","v":111}]
[null,{"$f":"B1101","v":369},"Dinner",{"$f":"ROUND(B1101*0.45,0)","v":166},null,{"$f":"(D1102+D1101+D1103)","v":369},{"$f":"(D1102+D1101+D1103)-F1103","v":0}]
[null,370,"Breakfast",{"$f":"ROUND(B1104*0.25,0)","v":93}]
[null,{"$f":"B1104","v":370},"Lunch",{"$f":"ROUND(B1104*0.3,0)","v":111}]
[null,{"$f":"B1104","v":370},"Dinner",{"$f":"ROUND(B1104*0.45,0)","v":167},null,{"$f":"(D1105+D1104+D1106)","v":371},{"$f":"(D1105+D1104+D1106)-F1106","v":0}]
[null,371,"Breakfast",{"$f":"ROUND(B1107*0.25,0)","v":93}]
[null,{"$f":"B1107","v":371},"Lunch",{"$f":"ROUND(B1107*0.3,0)","v":111}]
[null,{"$f":"B1107","v":371},"Dinner",{"$f":"ROUND(B1107*0.45,0)","v":167},null,{"$f":"(D1108+D1107+D1109)","v":371},{"$f":"(D1108+D1107+D1109)-F1109","v":0}]
[null,372,"Breakfast",{"$f":"ROUND(B1110*0.25,0)","v":93}]
[null,{"$f":"B1110","v":372},"Lunch",{"$f":"ROUND(B1110*0.3,0)","v":112}]
[null,{"$f":"B1110","v":372},"Dinner",{"$f":"ROUND(B1110*0.45,0)","v":167},null,{"$f":"(D1111+D1110+D1112)","v":372},{"$f":"(D1111+D1110+D1112)-F1112","v":0}]
[null,373,"Breakfast",{"$f":"ROUND(B1113*0.25,0)","v":93}]
[null,{"$f":"B1113","v":373},"Lunch",{"$f":"ROUND(B1113*0.3,0)","v":112}]
[null,{"$f":"B1113","v":373},"Dinner",{"$f":"ROUND(B1113*0.45,0)","v":168},null,{"$f":"(D1114+D1113+D1115)","v":373},{"$f":"(D1114+D1113+D1115)-F1115","v":0}]
[null,374,"Breakfast",{"$f":"ROUND(B1116*0.25,0)","v":94}]
[null,{"$f":"B1116","v":374},"Lunch",{"$f":"ROUND(B1116*0.3,0)","v":112}]
[null,{"$f":"B1116","v":374},"Dinner",{"$f":"ROUND(B1116*0.45,0)","v":168},null,{"$f":"(D1117+D1116+D1118)","v":374},{"$f":"(D1117+D1116+D1118)-F1118","v":0}]
[null,375,"Breakfast",{"$f":"ROUND(B1119*0.25,0)","v":94}]
[null,{"$f":"B1119","v":375},"Lunch",{"$f":"ROUND(B1119*0.3,0)","v":113}]
[null,{"$f":"B1119","v":375},"Dinner",{"$f":"ROUND(B1119*0.45,0)","v":169},null,{"$f":"(D1120+D1119+D1121)","v":376},{"$f":"(D1120+D1119+D1121)-F1121","v":0}]
[null,376,"Breakfast",{"$f":"ROUND(B1122*0.25,0)","v":94}]
[null,{"$f":"B1122","v":376},"Lunch",{"$f":"ROUND(B1122*0.3,0)","v":113}]
[null,{"$f":"B1122","v":376},"Dinner",{"$f":"ROUND(B1122*0.45,0)","v":169},null,{"$f":"(D1123+D1122+D1124)","v":376},{"$f":"(D1123+D1122+D1124)-F1124","v":0}]
[null,377,"Breakfast",{"$f":"ROUND(B1125*0.25,0)","v":94}]
[null,{"$f":"B1125","v":377},"Lunch",{"$f":"ROUND(B1125*0.3,0)","v":113}]
[null,{"$f":"B1125","v":377},"Dinner",{"$f":"ROUND(B1125*0.45,0)","v":170},null,{"$f":"(D1126+D1125+D1127)","v":377},{"$f":"(D1126+D1125+D1127)-F1127","v":0}]
[null,378,"Breakfast",{"$f":"ROUND(B1128*0.25,0)","v":95}]
[null,{"$f":"B1128","v":378},"Lunch",{"$f":"ROUND(B1128*0.3,0)","v":113}]
[null,{"$f":"B1128","v":378},"Dinner",{"$f":"ROUND(B1128*0.45,0)","v":170},null,{"$f":"(D1129+D1128+D1130)","v":378},{"$f":"(D1129+D1128+D1130)-F1130","v":0}]
[null,379,"Breakfast",{"$f":"ROUND(B1131*0.25,0)","v":95}]
[null,{"$f":"B1131","v":379},"Lunch",{"$f":"ROUND(B1131*0.3,0)","v":114}]
[null,{"$f":"B1131","v":379},"Dinner",{"$f":"ROUND(B1131*0.45,0)","v":171},null,{"$f":"(D1132+D1131+D1133)","v":380},{"$f":"(D1132+D1131+D1133)-F1133","v":0}]
[null,380,"Breakfast",{"$f":"ROUND(B1134*0.25,0)","v":95}]
[null,{"$f":"B1134","v":380},"Lunch",{"$f":"ROUND(B1134*0.3,0)","v":114}]
[null,{"$f":"B1134","v":380},"Dinner",{"$f":"ROUND(B1134*0.45,0)","v":171},null,{"$f":"(D1135+D1134+D1136)","v":380},{"$f":"(D1135+D1134+D1136)-F1136","v":0}]
[null,381,"Breakfast",{"$f":"ROUND(B1137*0.25,0)","v":95}]
[null,{"$f":"B1137","v":381},"Lunch",{"$f":"ROUND(B1137*0.3,0)","v":114}]
[null,{"$f":"B1137","v":381},"Dinner",{"$f":"ROUND(B1137*0.45,0)","v":171},null,{"$f":"(D1138+D1137+D1139)","v":380},{"$f":"(D1138+D1137+D1139)-F1139","v":0}]
[null,382,"Breakfast",{"$f":"ROUND(B1140*0.25,0)","v":96}]
[null,{"$f":"B1140","v":382},"Lunch",{"$f":"ROUND(B1140*0.3,0)","v":115}]
[null,{"$f":"B1140","v":382},"Dinner",{"$f":"ROUND(B1140*0.45,0)","v":172},null,{"$f":"(D1141+D1140+D1142)","v":383},{"$f":"(D1141+D1140+D1142)-F1142","v":0}]
[null,383,"Breakfast",{"$f":"ROUND(B1143*0.25,0)","v":96}]
[null,{"$f":"B1143","v":383},"Lunch",{"$f":"ROUND(B1143*0.3,0)","v":115}]
[null,{"$f":"B1143","v":383},"Dinner",{"$f":"ROUND(B1143*0.45,0)","v":172},null,{"$f":"(D1144+D1143+D1145)","v":383},{"$f":"(D1144+D1143+D1145)-F1145","v":0}]
[null,384,"Breakfast",{"$f":"ROUND(B1146*0.25,0)","v":96}]
[null,{"$f":"B1146","v":384},"Lunch",{"$f":"ROUND(B1146*0.3,0)","v":115}]
[null,{"$f":"B1146","v":384},"Dinner",{"$f":"ROUND(B1146*0.45,0)","v":173},null,{"$f":"(D1147+D1146+D1148)","v":384},{"$f":"(D1147+D1146+D1148)-F1148","v":0}]
[null,385,"Breakfast",{"$f":"ROUND(B1149*0.25,0)","v":96}]
[null,{"$f":"B1149","v":385},"Lunch",{"$f":"ROUND(B1149*0.3,0)","v":116}]
[null,{"$f":"B1149","v":385},"Dinner",{"$f":"ROUND(B1149*0.45,0)","v":173},null,{"$f":"(D1150+D1149+D1151)","v":385},{"$f":"(D1150+D1149+D1151)-F1151","v":0}]
[null,386,"Breakfast",{"$f":"ROUND(B1152*0.25,0)","v":97}]
[null,{"$f":"B1152","v":386},"Lunch",{"$f":"ROUND(B1152*0.3,0)","v":116}]
[null,{"$f":"B1152","v":386},"Dinner",{"$f":"ROUND(B1152*0.45,0)","v":174},null,{"$f":"(D1153+D1152+D1154)","v":387},{"$f":"(D1153+D1152+D1154)-F1154","v":0}]
[null,387,"Breakfast",{"$f":"ROUND(B1155*0.25,0)","v":97}]
[null,{"$f":"B1155","v":387},"Lunch",{"$f":"ROUND(B1155*0.3,0)","v":116}]
[null,{"$f":"B1155","v":387},"Dinner",{"$f":"ROUND(B1155*0.45,0)","v":174},null,{"$f":"(D1156+D1155+D1157)","v":387},{"$f":"(D1156+D1155+D1157)-F1157","v":0}]
[null,388,"Breakfast",{"$f":"ROUND(B1158*0.25,0)","v":97}]
[null,{"$f":"B1158","v":388},"Lunch",{"$f":"ROUND(B1158*0.3,0)","v":116}]
[null,{"$f":"B1158","v":388},"Dinner",{"$f":"ROUND(B1158*0.45,0)","v":175},null,{"$f":"(D1159+D1158+D1160)","v":388},{"$f":"(D1159+D1158+D1160)-F1160","v":0}]
[null,389,"Breakfast",{"$f":"ROUND(B1161*0.25,0)","v":97}]
[null,{"$f":"B1161","v":389},"Lunch",{"$f":"ROUND(B1161*0.3,0)","v":117}]
[null,{"$f":"B1161","v":389},"Dinner",{"$f":"ROUND(B1161*0.45,0)","v":175},null,{"$f":"(D1162+D1161+D1163)","v":389},{"$f":"(D1162+D1161+D1163)-F1163","v":0}]
[null,390,"Breakfast",{"$f":"ROUND(B1164*0.25,0)","v":98}]
[null,{"$f":"B1164","v":390},"Lunch",{"$f":"ROUND(B1164*0.3,0)","v":117}]
[null,{"$f":"B1164","v":390},"Dinner",{"$f":"ROUND(B1164*0.45,0)","v":176},null,{"$f":"(D1165+D1164+D1166)","v":391},{"$f":"(D1165+D1164+D1166)-F1166","v":0}]
[null,391,"Breakfast",{"$f":"ROUND(B1167*0.25,0)","v":98}]
[null,{"$f":"B1167","v":391},"Lunch",{"$f":"ROUND(B1167*0.3,0)","v":117}]
[null,{"$f":"B1167","v":391},"Dinner",{"$f":"ROUND(B1167*0.45,0)","v":176},null,{"$f":"(D1168+D1167+D1169)","v":391},{"$f":"(D1168+D1167+D1169)-F1169","v":0}]
[null,392,"Breakfast",{"$f":"ROUND(B1170*0.25,0)","v":98}]
[null,{"$f":"B1170","v":392},"Lunch",{"$f":"ROUND(B1170*0.3,0)","v":118}]
[null,{"$f":"B1170","v":392},"Dinner",{"$f":"ROUND(B1170*0.45,0)","v":176},null,{"$f":"(D1171+D1170+D1172)","v":392},{"$f":"(D1171+D1170+D1172)-F1172","v":0}]
[null,393,"Breakfast",{"$f":"ROUND(B1173*0.25,0)","v":98}]
[null,{"$f":"B1173","v":393},"Lunch",{"$f":"ROUND(B1173*0.3,0)","v":118}]
[null,{"$f":"B1173","v":393},"Dinner",{"$f":"ROUND(B1173*0.45,0)","v":177},null,{"$f":"(D1174+D1173+D1175)","v":393},{"$f":"(D1174+D1173+D1175)-F1175","v":0}]
[null,394,"Breakfast",{"$f":"ROUND(B1176*0.25,0)","v":99}]
[null,{"$f":"B1176","v":394},"Lunch",{"$f":"ROUND(B1176*0.3,0)","v":118}]
[null,{"$f":"B1176","v":394},"Dinner",{"$f":"ROUND(B1176*0.45,0)","v":177},null,{"$f":"(D1177+D1176+D1178)","v":394},{"$f":"(D1177+D1176+D1178)-F1178","v":0}]
[null,395,"Breakfast",{"$f":"ROUND(B1179*0.25,0)","v":99}]
[null,{"$f":"B1179","v":395},"Lunch",{"$f":"ROUND(B1179*0.3,0)","v":119}]
[null,{"$f":"B1179","v":395},"Dinner",{"$f":"ROUND(B1179*0.45,0)","v":178},null,{"$f":"(D1180+D1179+D1181)","v":396},{"$f":"(D1180+D1179+D1181)-F1181","v":0}]
[null,396,"Breakfast",{"$f":"ROUND(B1182*0.25,0)","v":99}]
[null,{"$f":"B1182","v":396},"Lunch",{"$f":"ROUND(B1182*0.3,0)","v":119}]
[null,{"$f":"B1182","v":396},"Dinner",{"$f":"ROUND(B1182*0.45,0)","v":178},null,{"$f":"(D1183+D1182+D1184)","v":396},{"$f":"(D1183+D1182+D1184)-F1184","v":0}]
[null,397,"Breakfast",{"$f":"ROUND(B1185*0.25,0)","v":99}]
[null,{"$f":"B1185","v":397},"Lunch",{"$f":"ROUND(B1185*0.3,0)","v":119}]
[null,{"$f":"B1185","v":397},"Dinner",{"$f":"ROUND(B1185*0.45,0)","v":179},null,{"$f":"(D1186+D1185+D1187)","v":397},{"$f":"(D1186+D1185+D1187)-F1187","v":0}]
[null,398,"Breakfast",{"$f":"ROUND(B1188*0.25,0)","v":100}]
[null,{"$f":"B1188","v":398},"Lunch",{"$f":"ROUND(B1188*0.3,0)","v":119}]
[null,{"$f":"B1188","v":398},"Dinner",{"$f":"ROUND(B1188*0.45,0)","v":179},null,{"$f":"(D1189+D1188+D1190)","v":398},{"$f":"(D1189+D1188+D1190)-F1190","v":0}]
[null,399,"Breakfast",{"$f":"ROUND(B1191*0.25,0)","v":100}]
[null,{"$f":"B1191","v":399},"Lunch",{"$f":"ROUND(B1191*0.3,0)","v":120}]
[null,{"$f":"B1191","v":399},"Dinner",{"$f":"ROUND(B1191*0.45,0)","v":180},null,{"$f":"(D1192+D1191+D1193)","v":400},{"$f":"(D1192+D1191+D1193)-F1193","v":0}]
[null,400,"Breakfast",{"$f":"ROUND(B1194*0.25,0)","v":100}]
[null,{"$f":"B1194","v":400},"Lunch",{"$f":"ROUND(B1194*0.3,0)","v":120}]
[null,{"$f":"B1194","v":400},"Dinner",{"$f":"ROUND(B1194*0.45,0)","v":180},null,{"$f":"(D1195+D1194+D1196)","v":400},{"$f":"(D1195+D1194+D1196)-F1196","v":0}]
[null,401,"Breakfast",{"$f":"ROUND(B1197*0.25,0)","v":100}]
[null,{"$f":"B1197","v":401},"Lunch",{"$f":"ROUND(B1197*0.3,0)","v":120}]
[null,{"$f":"B1197","v":401},"Dinner",{"$f":"ROUND(B1197*0.45,0)","v":180},null,{"$f":"(D1198+D1197+D1199)","v":400},{"$f":"(D1198+D1197+D1199)-F1199","v":0}]
[null,402,"Breakfast",{"$f":"ROUND(B1200*0.25,0)","v":101}]
[null,{"$f":"B1200","v":402},"Lunch",{"$f":"ROUND(B1200*0.3,0)","v":121}]
[null,{"$f":"B1200","v":402},"Dinner",{"$f":"ROUND(B1200*0.45,0)","v":181},null,{"$f":"(D1201+D1200+D1202)","v":403},{"$f":"(D1201+D1200+D1202)-F1202","v":0}]
[null,403,"Breakfast",{"$f":"ROUND(B1203*0.25,0)","v":101}]
[null,{"$f":"B1203","v":403},"Lunch",{"$f":"ROUND(B1203*0.3,0)","v":121}]
[null,{"$f":"B1203","v":403},"Dinner",{"$f":"ROUND(B1203*0.45,0)","v":181},null,{"$f":"(D1204+D1203+D1205)","v":403},{"$f":"(D1204+D1203+D1205)-F1205","v":0}]
[null,404,"Breakfast",{"$f":"ROUND(B1206*0.25,0)","v":101}]
[null,{"$f":"B1206","v":404},"Lunch",{"$f":"ROUND(B1206*0.3,0)","v":121}]
[null,{"$f":"B1206","v":404},"Dinner",{"$f":"ROUND(B1206*0.45,0)","v":182},null,{"$f":"(D1207+D1206+D1208)","v":404},{"$f":"(D1207+D1206+D1208)-F1208","v":0}]
[null,405,"Breakfast",{"$f":"ROUND(B1209*0.25,0)","v":101}]
[null,{"$f":"B1209","v":405},"Lunch",{"$f":"ROUND(B1209*0.3,0)","v":122}]
[null,{"$f":"B1209","v":405},"Dinner",{"$f":"ROUND(B1209*0.45,0)","v":182},null,{"$f":"(D1210+D1209+D1211)","v":405},{"$f":"(D1210+D1209+D1211)-F1211","v":0}]
[null,406,"Breakfast",{"$f":"ROUND(B1212*0.25,0)","v":102}]
[null,{"$f":"B1212","v":406},"Lunch",{"$f":"ROUND(B1212*0.3,0)","v":122}]
[null,{"$f":"B1212","v":406},"Dinner",{"$f":"ROUND(B1212*0.45,0)","v":183},null,{"$f":"(D1213+D1212+D1214)","v":407},{"$f":"(D1213+D1212+D1214)-F1214","v":0}]
[null,407,"Breakfast",{"$f":"ROUND(B1215*0.25,0)","v":102}]
[null,{"$f":"B1215","v":407},"Lunch",{"$f":"ROUND(B1215*0.3,0)","v":122}]
[null,{"$f":"B1215","v":407},"Dinner",{"$f":"ROUND(B1215*0.45,0)","v":183},null,{"$f":"(D1216+D1215+D1217)","v":407},{"$f":"(D1216+D1215+D1217)-F1217","v":0}]
[null,408,"Breakfast",{"$f":"ROUND(B1218*0.25,0)","v":102}]
[null,{"$f":"B1218","v":408},"Lunch",{"$f":"ROUND(B1218*0.3,0)","v":122}]
[null,{"$f":"B1218","v":408},"Dinner",{"$f":"ROUND(B1218*0.45,0)","v":184},null,{"$f":"(D1219+D1218+D1220)","v":408},{"$f":"(D1219+D1218+D1220)-F1220","v":0}]
[null,409,"Breakfast",{"$f":"ROUND(B1221*0.25,0)","v":102}]
[null,{"$f":"B1221","v":409},"Lunch",{"$f":"ROUND(B1221*0.3,0)","v":123}]
[null,{"$f":"B1221","v":409},"Dinner",{"$f":"ROUND(B1221*0.45,0)","v":184},null,{"$f":"(D1222+D1221+D1223)","v":409},{"$f":"(D1222+D1221+D1223)-F1223","v":0}]
[null,410,"Breakfast",{"$f":"ROUND(B1224*0.25,0)","v":103}]
[null,{"$f":"B1224","v":410},"Lunch",{"$f":"ROUND(B1224*0.3,0)","v":123}]
[null,{"$f":"B1224","v":410},"Dinner",{"$f":"ROUND(B1224*0.45,0)","v":185},null,{"$f":"(D1225+D1224+D1226)","v":411},{"$f":"(D1225+D1224+D1226)-F1226","v":0}]
[null,411,"Breakfast",{"$f":"ROUND(B1227*0.25,0)","v":103}]
[null,{"$f":"B1227","v":411},"Lunch",{"$f":"ROUND(B1227*0.3,0)","v":123}]
[null,{"$f":"B1227","v":411},"Dinner",{"$f":"ROUND(B1227*0.45,0)","v":185},null,{"$f":"(D1228+D1227+D1229)","v":411},{"$f":"(D1228+D1227+D1229)-F1229","v":0}]
[null,412,"Breakfast",{"$f":"ROUND(B1230*0.25,0)","v":103}]
[null,{"$f":"B1230","v":412},"Lunch",{"$f":"ROUND(B1230*0.3,0)","v":124}]
[null,{"$f":"B1230","v":412},"Dinner",{"$f":"ROUND(B1230*0.45,0)","v":185},null,{"$f":"(D1231+D1230+D1232)","v":412},{"$f":"(D1231+D1230+D1232)-F1232","v":0}]
[null,413,"Breakfast",{"$f":"ROUND(B1233*0.25,0)","v":103}]
[null,{"$f":"B1233","v":413},"Lunch",{"$f":"ROUND(B1233*0.3,0)","v":124}]
[null,{"$f":"B1233","v":413},"Dinner",{"$f":"ROUND(B1233*0.45,0)","v":186},null,{"$f":"(D1234+D1233+D1235)","v":413},{"$f":"(D1234+D1233+D1235)-F1235","v":0}]
[null,414,"Breakfast",{"$f":"ROUND(B1236*0.25,0)","v":104}]
[null,{"$f":"B1236","v":414},"Lunch",{"$f":"ROUND(B1236*0.3,0)","v":124}]
[null,{"$f":"B1236","v":414},"Dinner",{"$f":"ROUND(B1236*0.45,0)","v":186},null,{"$f":"(D1237+D1236+D1238)","v":414},{"$f":"(D1237+D1236+D1238)-F1238","v":0}]
[null,415,"Breakfast",{"$f":"ROUND(B1239*0.25,0)","v":104}]
[null,{"$f":"B1239","v":415},"Lunch",{"$f":"ROUND(B1239*0.3,0)","v":125}]
[null,{"$f":"B1239","v":415},"Dinner",{"$f":"ROUND(B1239*0.45,0)","v":187},null,{"$f":"(D1240+D1239+D1241)","v":416},{"$f":"(D1240+D1239+D1241)-F1241","v":0}]
[null,416,"Breakfast",{"$f":"ROUND(B1242*0.25,0)","v":104}]
[null,{"$f":"B1242","v":416},"Lunch",{"$f":"ROUND(B1242*0.3,0)","v":125}]
[null,{"$f":"B1242","v":416},"Dinner",{"$f":"ROUND(B1242*0.45,0)","v":187},null,{"$f":"(D1243+D1242+D1244)","v":416},{"$f":"(D1243+D1242+D1244)-F1244","v":0}]
[null,417,"Breakfast",{"$f":"ROUND(B1245*0.25,0)","v":104}]
[null,{"$f":"B1245","v":417},"Lunch",{"$f":"ROUND(B1245*0.3,0)","v":125}]
[null,{"$f":"B1245","v":417},"Dinner",{"$f":"ROUND(B1245*0.45,0)","v":188},null,{"$f":"(D1246+D1245+D1247)","v":417},{"$f":"(D1246+D1245+D1247)-F1247","v":0}]
[null,418,"Breakfast",{"$f":"ROUND(B1248*0.25,0)","v":105}]
[null,{"$f":"B1248","v":418},"Lunch",{"$f":"ROUND(B1248*0.3,0)","v":125}]
[null,{"$f":"B1248","v":418},"Dinner",{"$f":"ROUND(B1248*0.45,0)","v":188},null,{"$f":"(D1249+D1248+D1250)","v":418},{"$f":"(D1249+D1248+D1250)-F1250","v":0}]
[null,419,"Breakfast",{"$f":"ROUND(B1251*0.25,0)","v":105}]
[null,{"$f":"B1251","v":419},"Lunch",{"$f":"ROUND(B1251*0.3,0)","v":126}]
[null,{"$f":"B1251","v":419},"Dinner",{"$f":"ROUND(B1251*0.45,0)","v":189},null,{"$f":"(D1252+D1251+D1253)","v":420},{"$f":"(D1252+D1251+D1253)-F1253","v":0}]
[null,420,"Breakfast",{"$f":"ROUND(B1254*0.25,0)","v":105}]
[null,{"$f":"B1254","v":420},"Lunch",{"$f":"ROUND(B1254*0.3,0)","v":126}]
[null,{"$f":"B1254","v":420},"Dinner",{"$f":"ROUND(B1254*0.45,0)","v":189},null,{"$f":"(D1255+D1254+D1256)","v":420},{"$f":"(D1255+D1254+D1256)-F1256","v":0}]
[null,421,"Breakfast",{"$f":"ROUND(B1257*0.25,0)","v":105}]
[null,{"$f":"B1257","v":421},"Lunch",{"$f":"ROUND(B1257*0.3,0)","v":126}]
[null,{"$f":"B1257","v":421},"Dinner",{"$f":"ROUND(B1257*0.45,0)","v":189},null,{"$f":"(D1258+D1257+D1259)","v":420},{"$f":"(D1258+D1257+D1259)-F1259","v":0}]
[null,422,"Breakfast",{"$f":"ROUND(B1260*0.25,0)","v":106}]
[null,{"$f":"B1260","v":422},"Lunch",{"$f":"ROUND(B1260*0.3,0)","v":127}]
[null,{"$f":"B1260","v":422},"Dinner",{"$f":"ROUND(B1260*0.45,0)","v":190},null,{"$f":"(D1261+D1260+D1262)","v":423},{"$f":"(D1261+D1260+D1262)-F1262","v":0}]
[null,423,"Breakfast",{"$f":"ROUND(B1263*0.25,0)","v":106}]
[null,{"$f":"B1263","v":423},"Lunch",{"$f":"ROUND(B1263*0.3,0)","v":127}]
[null,{"$f":"B1263","v":423},"Dinner",{"$f":"ROUND(B1263*0.45,0)","v":190},null,{"$f":"(D1264+D1263+D1265)","v":423},{"$f":"(D1264+D1263+D1265)-F1265","v":0}]
[null,424,"Breakfast",{"$f":"ROUND(B1266*0.25,0)","v":106}]
[null,{"$f":"B1266","v":424},"Lunch",{"$f":"ROUND(B1266*0.3,0)","v":127}]
[null,{"$f":"B1266","v":424},"Dinner",{"$f":"ROUND(B1266*0.45,0)","v":191},null,{"$f":"(D1267+D1266+D1268)","v":424},{"$f":"(D1267+D1266+D1268)-F1268","v":0}]
[null,425,"Breakfast",{"$f":"ROUND(B1269*0.25,0)","v":106}]
[null,{"$f":"B1269","v":425},"Lunch",{"$f":"ROUND(B1269*0.3,0)","v":128}]
[null,{"$f":"B1269","v":425},"Dinner",{"$f":"ROUND(B1269*0.45,0)","v":191},null,{"$f":"(D1270+D1269+D1271)","v":425},{"$f":"(D1270+D1269+D1271)-F1271","v":0}]
[null,426,"Breakfast",{"$f":"ROUND(B1272*0.25,0)","v":107}]
[null,{"$f":"B1272","v":426},"Lunch",{"$f":"ROUND(B1272*0.3,0)","v":128}]
[null,{"$f":"B1272","v":426},"Dinner",{"$f":"ROUND(B1272*0.45,0)","v":192},null,{"$f":"(D1273+D1272+D1274)","v":427},{"$f":"(D1273+D1272+D1274)-F1274","v":0}]
[null,427,"Breakfast",{"$f":"ROUND(B1275*0.25,0)","v":107}]
[null,{"$f":"B1275","v":427},"Lunch",{"$f":"ROUND(B1275*0.3,0)","v":128}]
[null,{"$f":"B1275","v":427},"Dinner",{"$f":"ROUND(B1275*0.45,0)","v":192},null,{"$f":"(D1276+D1275+D1277)","v":427},{"$f":"(D1276+D1275+D1277)-F1277","v":0}]
[null,428,"Breakfast",{"$f":"ROUND(B1278*0.25,0)","v":107}]
[null,{"$f":"B1278","v":428},"Lunch",{"$f":"ROUND(B1278*0.3,0)","v":128}]
[null,{"$f":"B1278","v":428},"Dinner",{"$f":"ROUND(B1278*0.45,0)","v":193},null,{"$f":"(D1279+D1278+D1280)","v":428},{"$f":"(D1279+D1278+D1280)-F1280","v":0}]
[null,429,"Breakfast",{"$f":"ROUND(B1281*0.25,0)","v":107}]
[null,{"$f":"B1281","v":429},"Lunch",{"$f":"ROUND(B1281*0.3,0)","v":129}]
[null,{"$f":"B1281","v":429},"Dinner",{"$f":"ROUND(B1281*0.45,0)","v":193},null,{"$f":"(D1282+D1281+D1283)","v":429},{"$f":"(D1282+D1281+D1283)-F1283","v":0}]
[null,430,"Breakfast",{"$f":"ROUND(B1284*0.25,0)","v":108}]
[null,{"$f":"B1284","v":430},"Lunch",{"$f":"ROUND(B1284*0.3,0)","v":129}]
[null,{"$f":"B1284","v":430},"Dinner",{"$f":"ROUND(B1284*0.45,0)","v":194},null,{"$f":"(D1285+D1284+D1286)","v":431},{"$f":"(D1285+D1284+D1286)-F1286","v":0}]
[null,431,"Breakfast",{"$f":"ROUND(B1287*0.25,0)","v":108}]
[null,{"$f":"B1287","v":431},"Lunch",{"$f":"ROUND(B1287*0.3,0)","v":129}]
[null,{"$f":"B1287","v":431},"Dinner",{"$f":"ROUND(B1287*0.45,0)","v":194},null,{"$f":"(D1288+D1287+D1289)","v":431},{"$f":"(D1288+D1287+D1289)-F1289","v":0}]
[null,432,"Breakfast",{"$f":"ROUND(B1290*0.25,0)","v":108}]
[null,{"$f":"B1290","v":432},"Lunch",{"$f":"ROUND(B1290*0.3,0)","v":130}]
[null,{"$f":"B1290","v":432},"Dinner",{"$f":"ROUND(B1290*0.45,0)","v":194},null,{"$f":"(D1291+D1290+D1292)","v":432},{"$f":"(D1291+D1290+D1292)-F1292","v":0}]
[null,433,"Breakfast",{"$f":"ROUND(B1293*0.25,0)","v":108}]
[null,{"$f":"B1293","v":433},"Lunch",{"$f":"ROUND(B1293*0.3,0)","v":130}]
[null,{"$f":"B1293","v":433},"Dinner",{"$f":"ROUND(B1293*0.45,0)","v":195},null,{"$f":"(D1294+D1293+D1295)","v":433},{"$f":"(D1294+D1293+D1295)-F1295","v":0}]
[null,434,"Breakfast",{"$f":"ROUND(B1296*0.25,0)","v":109}]
[null,{"$f":"B1296","v":434},"Lunch",{"$f":"ROUND(B1296*0.3,0)","v":130}]
[null,{"$f":"B1296","v":434},"Dinner",{"$f":"ROUND(B1296*0.45,0)","v":195},null,{"$f":"(D1297+D1296+D1298)","v":434},{"$f":"(D1297+D1296+D1298)-F1298","v":0}]
[null,435,"Breakfast",{"$f":"ROUND(B1299*0.25,0)","v":109}]
[null,{"$f":"B1299","v":435},"Lunch",{"$f":"ROUND(B1299*0.3,0)","v":131}]
[null,{"$f":"B1299","v":435},"Dinner",{"$f":"ROUND(B1299*0.45,0)","v":196},null,{"$f":"(D1300+D1299+D1301)","v":436},{"$f":"(D1300+D1299+D1301)-F1301","v":0}]
[null,436,"Breakfast",{"$f":"ROUND(B1302*0.25,0)","v":109}]
[null,{"$f":"B1302","v":436},"Lunch",{"$f":"ROUND(B1302*0.3,0)","v":131}]
[null,{"$f":"B1302","v":436},"Dinner",{"$f":"ROUND(B1302*0.45,0)","v":196},null,{"$f":"(D1303+D1302+D1304)","v":436},{"$f":"(D1303+D1302+D1304)-F1304","v":0}]
[null,437,"Breakfast",{"$f":"ROUND(B1305*0.25,0)","v":109}]
[null,{"$f":"B1305","v":437},"Lunch",{"$f":"ROUND(B1305*0.3,0)","v":131}]
[null,{"$f":"B1305","v":437},"Dinner",{"$f":"ROUND(B1305*0.45,0)","v":197},null,{"$f":"(D1306+D1305+D1307)","v":437},{"$f":"(D1306+D1305+D1307)-F1307","v":0}]
[null,438,"Breakfast",{"$f":"ROUND(B1308*0.25,0)","v":110}]
[null,{"$f":"B1308","v":438},"Lunch",{"$f":"ROUND(B1308*0.3,0)","v":131}]
[null,{"$f":"B1308","v":438},"Dinner",{"$f":"ROUND(B1308*0.45,0)","v":197},null,{"$f":"(D1309+D1308+D1310)","v":438},{"$f":"(D1309+D1308+D1310)-F1310","v":0}]
[null,439,"Breakfast",{"$f":"ROUND(B1311*0.25,0)","v":110}]
[null,{"$f":"B1311","v":439},"Lunch",{"$f":"ROUND(B1311*0.3,0)","v":132}]
[null,{"$f":"B1311","v":439},"Dinner",{"$f":"ROUND(B1311*0.45,0)","v":198},null,{"$f":"(D1312+D1311+D1313)","v":440},{"$f":"(D1312+D1311+D1313)-F1313","v":0}]
[null,440,"Breakfast",{"$f":"ROUND(B1314*0.25,0)","v":110}]
[null,{"$f":"B1314","v":440},"Lunch",{"$f":"ROUND(B1314*0.3,0)","v":132}]
[null,{"$f":"B1314","v":440},"Dinner",{"$f":"ROUND(B1314*0.45,0)","v":198},null,{"$f":"(D1315+D1314+D1316)","v":440},{"$f":"(D1315+D1314+D1316)-F1316","v":0}]
[null,441,"Breakfast",{"$f":"ROUND(B1317*0.25,0)","v":110}]
[null,{"$f":"B1317","v":441},"Lunch",{"$f":"ROUND(B1317*0.3,0)","v":132}]
[null,{"$f":"B1317","v":441},"Dinner",{"$f":"ROUND(B1317*0.45,0)","v":198},null,{"$f":"(D1318+D1317+D1319)","v":440},{"$f":"(D1318+D1317+D1319)-F1319","v":0}]
[null,442,"Breakfast",{"$f":"ROUND(B1320*0.25,0)","v":111}]
[null,{"$f":"B1320","v":442},"Lunch",{"$f":"ROUND(B1320*0.3,0)","v":133}]
[null,{"$f":"B1320","v":442},"Dinner",{"$f":"ROUND(B1320*0.45,0)","v":199},null,{"$f":"(D1321+D1320+D1322)","v":443},{"$f":"(D1321+D1320+D1322)-F1322","v":0}]
[null,443,"Breakfast",{"$f":"ROUND(B1323*0.25,0)","v":111}]
[null,{"$f":"B1323","v":443},"Lunch",{"$f":"ROUND(B1323*0.3,0)","v":133}]
[null,{"$f":"B1323","v":443},"Dinner",{"$f":"ROUND(B1323*0.45,0)","v":199},null,{"$f":"(D1324+D1323+D1325)","v":443},{"$f":"(D1324+D1323+D1325)-F1325","v":0}]
[null,444,"Breakfast",{"$f":"ROUND(B1326*0.25,0)","v":111}]
[null,{"$f":"B1326","v":444},"Lunch",{"$f":"ROUND(B1326*0.3,0)","v":133}]
[null,{"$f":"B1326","v":444},"Dinner",{"$f":"ROUND(B1326*0.45,0)","v":200},null,{"$f":"(D1327+D1326+D1328)","v":444},{"$f":"(D1327+D1326+D1328)-F1328","v":0}]
[null,445,"Breakfast",{"$f":"ROUND(B1329*0.25,0)","v":111}]
[null,{"$f":"B1329","v":445},"Lunch",{"$f":"ROUND(B1329*0.3,0)","v":134}]
[null,{"$f":"B1329","v":445},"Dinner",{"$f":"ROUND(B1329*0.45,0)","v":200},null,{"$f":"(D1330+D1329+D1331)","v":445},{"$f":"(D1330+D1329+D1331)-F1331","v":0}]
[null,446,"Breakfast",{"$f":"ROUND(B1332*0.25,0)","v":112}]
[null,{"$f":"B1332","v":446},"Lunch",{"$f":"ROUND(B1332*0.3,0)","v":134}]
[null,{"$f":"B1332","v":446},"Dinner",{"$f":"ROUND(B1332*0.45,0)","v":201},null,{"$f":"(D1333+D1332+D1334)","v":447},{"$f":"(D1333+D1332+D1334)-F1334","v":0}]
[null,447,"Breakfast",{"$f":"ROUND(B1335*0.25,0)","v":112}]
[null,{"$f":"B1335","v":447},"Lunch",{"$f":"ROUND(B1335*0.3,0)","v":134}]
[null,{"$f":"B1335","v":447},"Dinner",{"$f":"ROUND(B1335*0.45,0)","v":201},null,{"$f":"(D1336+D1335+D1337)","v":447},{"$f":"(D1336+D1335+D1337)-F1337","v":0}]
[null,448,"Breakfast",{"$f":"ROUND(B1338*0.25,0)","v":112}]
[null,{"$f":"B1338","v":448},"Lunch",{"$f":"ROUND(B1338*0.3,0)","v":134}]
[null,{"$f":"B1338","v":448},"Dinner",{"$f":"ROUND(B1338*0.45,0)","v":202},null,{"$f":"(D1339+D1338+D1340)","v":448},{"$f":"(D1339+D1338+D1340)-F1340","v":0}]
[null,449,"Breakfast",{"$f":"ROUND(B1341*0.25,0)","v":112}]
[null,{"$f":"B1341","v":449},"Lunch",{"$f":"ROUND(B1341*0.3,0)","v":135}]
[null,{"$f":"B1341","v":449},"Dinner",{"$f":"ROUND(B1341*0.45,0)","v":202},null,{"$f":"(D1342+D1341+D1343)","v":449},{"$f":"(D1342+D1341+D1343)-F1343","v":0}]
[null,450,"Breakfast",{"$f":"ROUND(B1344*0.25,0)","v":113}]
[null,{"$f":"B1344","v":450},"Lunch",{"$f":"ROUND(B1344*0.3,0)","v":135}]
[null,{"$f":"B1344","v":450},"Dinner",{"$f":"ROUND(B1344*0.45,0)","v":203},null,{"$f":"(D1345+D1344+D1346)","v":451},{"$f":"(D1345+D1344+D1346)-F1346","v":0}]
[null,451,"Breakfast",{"$f":"ROUND(B1347*0.25,0)","v":113}]
[null,{"$f":"B1347","v":451},"Lunch",{"$f":"ROUND(B1347*0.3,0)","v":135}]
[null,{"$f":"B1347","v":451},"Dinner",{"$f":"ROUND(B1347*0.45,0)","v":203},null,{"$f":"(D1348+D1347+D1349)","v":451},{"$f":"(D1348+D1347+D1349)-F1349","v":0}]
[null,452,"Breakfast",{"$f":"ROUND(B1350*0.25,0)","v":113}]
[null,{"$f":"B1350","v":452},"Lunch",{"$f":"ROUND(B1350*0.3,0)","v":136}]
[null,{"$f":"B1350","v":452},"Dinner",{"$f":"ROUND(B1350*0.45,0)","v":203},null,{"$f":"(D1351+D1350+D1352)","v":452},{"$f":"(D1351+D1350+D1352)-F1352","v":0}]
[null,453,"Breakfast",{"$f":"ROUND(B1353*0.25,0)","v":113}]
[null,{"$f":"B1353","v":453},"Lunch",{"$f":"ROUND(B1353*0.3,0)","v":136}]
[null,{"$f":"B1353","v":453},"Dinner",{"$f":"ROUND(B1353*0.45,0)","v":204},null,{"$f":"(D1354+D1353+D1355)","v":453},{"$f":"(D1354+D1353+D1355)-F1355","v":0}]
[null,454,"Breakfast",{"$f":"ROUND(B1356*0.25,0)","v":114}]
[null,{"$f":"B1356","v":454},"Lunch",{"$f":"ROUND(B1356*0.3,0)","v":136}]
[null,{"$f":"B1356","v":454},"Dinner",{"$f":"ROUND(B1356*0.45,0)","v":204},null,{"$f":"(D1357+D1356+D1358)","v":454},{"$f":"(D1357+D1356+D1358)-F1358","v":0}]
[null,455,"Breakfast",{"$f":"ROUND(B1359*0.25,0)","v":114}]
[null,{"$f":"B1359","v":455},"Lunch",{"$f":"ROUND(B1359*0.3,0)","v":137}]
[null,{"$f":"B1359","v":455},"Dinner",{"$f":"ROUND(B1359*0.45,0)","v":205},null,{"$f":"(D1360+D1359+D1361)","v":456},{"$f":"(D1360+D1359+D1361)-F1361","v":0}]
[null,456,"Breakfast",{"$f":"ROUND(B1362*0.25,0)","v":114}]
[null,{"$f":"B1362","v":456},"Lunch",{"$f":"ROUND(B1362*0.3,0)","v":137}]
[null,{"$f":"B1362","v":456},"Dinner",{"$f":"ROUND(B1362*0.45,0)","v":205},null,{"$f":"(D1363+D1362+D1364)","v":456},{"$f":"(D1363+D1362+D1364)-F1364","v":0}]
[null,457,"Breakfast",{"$f":"ROUND(B1365*0.25,0)","v":114}]
[null,{"$f":"B1365","v":457},"Lunch",{"$f":"ROUND(B1365*0.3,0)","v":137}]
[null,{"$f":"B1365","v":457},"Dinner",{"$f":"ROUND(B1365*0.45,0)","v":206},null,{"$f":"(D1366+D1365+D1367)","v":457},{"$f":"(D1366+D1365+D1367)-F1367","v":0}]
[null,458,"Breakfast",{"$f":"ROUND(B1368*0.25,0)","v":115}]
[null,{"$f":"B1368","v":458},"Lunch",{"$f":"ROUND(B1368*0.3,0)","v":137}]
[null,{"$f":"B1368","v":458},"Dinner",{"$f":"ROUND(B1368*0.45,0)","v":206},null,{"$f":"(D1369+D1368+D1370)","v":458},{"$f":"(D1369+D1368+D1370)-F1370","v":0}]
[null,459,"Breakfast",{"$f":"ROUND(B1371*0.25,0)","v":115}]
[null,{"$f":"B1371","v":459},"Lunch",{"$f":"ROUND(B1371*0.3,0)","v":138}]
[null,{"$f":"B1371","v":459},"Dinner",{"$f":"ROUND(B1371*0.45,0)","v":207},null,{"$f":"(D1372+D1371+D1373)","v":460},{"$f":"(D1372+D1371+D1373)-F1373","v":0}]
[null,460,"Breakfast",{"$f":"ROUND(B1374*0.25,0)","v":115}]
[null,{"$f":"B1374","v":460},"Lunch",{"$f":"ROUND(B1374*0.3,0)","v":138}]
[null,{"$f":"B1374","v":460},"Dinner",{"$f":"ROUND(B1374*0.45,0)","v":207},null,{"$f":"(D1375+D1374+D1376)","v":460},{"$f":"(D1375+D1374+D1376)-F1376","v":0}]
[null,461,"Breakfast",{"$f":"ROUND(B1377*0.25,0)","v":115}]
[null,{"$f":"B1377","v":461},"Lunch",{"$f":"ROUND(B1377*0.3,0)","v":138}]
[null,{"$f":"B1377","v":461},"Dinner",{"$f":"ROUND(B1377*0.45,0)","v":207},null,{"$f":"(D1378+D1377+D1379)","v":460},{"$f":"(D1378+D1377+D1379)-F1379","v":0}]
[null,462,"Breakfast",{"$f":"ROUND(B1380*0.25,0)","v":116}]
[null,{"$f":"B1380","v":462},"Lunch",{"$f":"ROUND(B1380*0.3,0)","v":139}]
[null,{"$f":"B1380","v":462},"Dinner",{"$f":"ROUND(B1380*0.45,0)","v":208},null,{"$f":"(D1381+D1380+D1382)","v":463},{"$f":"(D1381+D1380+D1382)-F1382","v":0}]
[null,463,"Breakfast",{"$f":"ROUND(B1383*0.25,0)","v":116}]
[null,{"$f":"B1383","v":463},"Lunch",{"$f":"ROUND(B1383*0.3,0)","v":139}]
[null,{"$f":"B1383","v":463},"Dinner",{"$f":"ROUND(B1383*0.45,0)","v":208},null,{"$f":"(D1384+D1383+D1385)","v":463},{"$f":"(D1384+D1383+D1385)-F1385","v":0}]
[null,464,"Breakfast",{"$f":"ROUND(B1386*0.25,0)","v":116}]
[null,{"$f":"B1386","v":464},"Lunch",{"$f":"ROUND(B1386*0.3,0)","v":139}]
[null,{"$f":"B1386","v":464},"Dinner",{"$f":"ROUND(B1386*0.45,0)","v":209},null,{"$f":"(D1387+D1386+D1388)","v":464},{"$f":"(D1387+D1386+D1388)-F1388","v":0}]
[null,465,"Breakfast",{"$f":"ROUND(B1389*0.25,0)","v":116}]
[null,{"$f":"B1389","v":465},"Lunch",{"$f":"ROUND(B1389*0.3,0)","v":140}]
[null,{"$f":"B1389","v":465},"Dinner",{"$f":"ROUND(B1389*0.45,0)","v":209},null,{"$f":"(D1390+D1389+D1391)","v":465},{"$f":"(D1390+D1389+D1391)-F1391","v":0}]
[null,466,"Breakfast",{"$f":"ROUND(B1392*0.25,0)","v":117}]
[null,{"$f":"B1392","v":466},"Lunch",{"$f":"ROUND(B1392*0.3,0)","v":140}]
[null,{"$f":"B1392","v":466},"Dinner",{"$f":"ROUND(B1392*0.45,0)","v":210},null,{"$f":"(D1393+D1392+D1394)","v":467},{"$f":"(D1393+D1392+D1394)-F1394","v":0}]
[null,467,"Breakfast",{"$f":"ROUND(B1395*0.25,0)","v":117}]
[null,{"$f":"B1395","v":467},"Lunch",{"$f":"ROUND(B1395*0.3,0)","v":140}]
[null,{"$f":"B1395","v":467},"Dinner",{"$f":"ROUND(B1395*0.45,0)","v":210},null,{"$f":"(D1396+D1395+D1397)","v":467},{"$f":"(D1396+D1395+D1397)-F1397","v":0}]
[null,468,"Breakfast",{"$f":"ROUND(B1398*0.25,0)","v":117}]
[null,{"$f":"B1398","v":468},"Lunch",{"$f":"ROUND(B1398*0.3,0)","v":140}]
[null,{"$f":"B1398","v":468},"Dinner",{"$f":"ROUND(B1398*0.45,0)","v":211},null,{"$f":"(D1399+D1398+D1400)","v":468},{"$f":"(D1399+D1398+D1400)-F1400","v":0}]
[null,469,"Breakfast",{"$f":"ROUND(B1401*0.25,0)","v":117}]
[null,{"$f":"B1401","v":469},"Lunch",{"$f":"ROUND(B1401*0.3,0)","v":141}]
[null,{"$f":"B1401","v":469},"Dinner",{"$f":"ROUND(B1401*0.45,0)","v":211},null,{"$f":"(D1402+D1401+D1403)","v":469},{"$f":"(D1402+D1401+D1403)-F1403","v":0}]
[null,470,"Breakfast",{"$f":"ROUND(B1404*0.25,0)","v":118}]
[null,{"$f":"B1404","v":470},"Lunch",{"$f":"ROUND(B1404*0.3,0)","v":141}]
[null,{"$f":"B1404","v":470},"Dinner",{"$f":"ROUND(B1404*0.45,0)","v":212},null,{"$f":"(D1405+D1404+D1406)","v":471},{"$f":"(D1405+D1404+D1406)-F1406","v":0}]
[null,471,"Breakfast",{"$f":"ROUND(B1407*0.25,0)","v":118}]
[null,{"$f":"B1407","v":471},"Lunch",{"$f":"ROUND(B1407*0.3,0)","v":141}]
[null,{"$f":"B1407","v":471},"Dinner",{"$f":"ROUND(B1407*0.45,0)","v":212},null,{"$f":"(D1408+D1407+D1409)","v":471},{"$f":"(D1408+D1407+D1409)-F1409","v":0}]
[null,472,"Breakfast",{"$f":"ROUND(B1410*0.25,0)","v":118}]
[null,{"$f":"B1410","v":472},"Lunch",{"$f":"ROUND(B1410*0.3,0)","v":142}]
[null,{"$f":"B1410","v":472},"Dinner",{"$f":"ROUND(B1410*0.45,0)","v":212},null,{"$f":"(D1411+D1410+D1412)","v":472},{"$f":"(D1411+D1410+D1412)-F1412","v":0}]
[null,473,"Breakfast",{"$f":"ROUND(B1413*0.25,0)","v":118}]
[null,{"$f":"B1413","v":473},"Lunch",{"$f":"ROUND(B1413*0.3,0)","v":142}]
[null,{"$f":"B1413","v":473},"Dinner",{"$f":"ROUND(B1413*0.45,0)","v":213},null,{"$f":"(D1414+D1413+D1415)","v":473},{"$f":"(D1414+D1413+D1415)-F1415","v":0}]
[null,474,"Breakfast",{"$f":"ROUND(B1416*0.25,0)","v":119}]
[null,{"$f":"B1416","v":474},"Lunch",{"$f":"ROUND(B1416*0.3,0)","v":142}]
[null,{"$f":"B1416","v":474},"Dinner",{"$f":"ROUND(B1416*0.45,0)","v":213},null,{"$f":"(D1417+D1416+D1418)","v":474},{"$f":"(D1417+D1416+D1418)-F1418","v":0}]
[null,475,"Breakfast",{"$f":"ROUND(B1419*0.25,0)","v":119}]
[null,{"$f":"B1419","v":475},"Lunch",{"$f":"ROUND(B1419*0.3,0)","v":143}]
[null,{"$f":"B1419","v":475},"Dinner",{"$f":"ROUND(B1419*0.45,0)","v":214},null,{"$f":"(D1420+D1419+D1421)","v":476},{"$f":"(D1420+D1419+D1421)-F1421","v":0}]
[null,476,"Breakfast",{"$f":"ROUND(B1422*0.25,0)","v":119}]
[null,{"$f":"B1422","v":476},"Lunch",{"$f":"ROUND(B1422*0.3,0)","v":143}]
[null,{"$f":"B1422","v":476},"Dinner",{"$f":"ROUND(B1422*0.45,0)","v":214},null,{"$f":"(D1423+D1422+D1424)","v":476},{"$f":"(D1423+D1422+D1424)-F1424","v":0}]
[null,477,"Breakfast",{"$f":"ROUND(B1425*0.25,0)","v":119}]
[null,{"$f":"B1425","v":477},"Lunch",{"$f":"ROUND(B1425*0.3,0)","v":143}]
[null,{"$f":"B1425","v":477},"Dinner",{"$f":"ROUND(B1425*0.45,0)","v":215},null,{"$f":"(D1426+D1425+D1427)","v":477},{"$f":"(D1426+D1425+D1427)-F1427","v":0}]
[null,478,"Breakfast",{"$f":"ROUND(B1428*0.25,0)","v":120}]
[null,{"$f":"B1428","v":478},"Lunch",{"$f":"ROUND(B1428*0.3,0)","v":143}]
[null,{"$f":"B1428","v":478},"Dinner",{"$f":"ROUND(B1428*0.45,0)","v":215},null,{"$f":"(D1429+D1428+D1430)","v":478},{"$f":"(D1429+D1428+D1430)-F1430","v":0}]
[null,479,"Breakfast",{"$f":"ROUND(B1431*0.25,0)","v":120}]
[null,{"$f":"B1431","v":479},"Lunch",{"$f":"ROUND(B1431*0.3,0)","v":144}]
[null,{"$f":"B1431","v":479},"Dinner",{"$f":"ROUND(B1431*0.45,0)","v":216},null,{"$f":"(D1432+D1431+D1433)","v":480},{"$f":"(D1432+D1431+D1433)-F1433","v":0}]
[null,480,"Breakfast",{"$f":"ROUND(B1434*0.25,0)","v":120}]
[null,{"$f":"B1434","v":480},"Lunch",{"$f":"ROUND(B1434*0.3,0)","v":144}]
[null,{"$f":"B1434","v":480},"Dinner",{"$f":"ROUND(B1434*0.45,0)","v":216},null,{"$f":"(D1435+D1434+D1436)","v":480},{"$f":"(D1435+D1434+D1436)-F1436","v":0}]
[null,481,"Breakfast",{"$f":"ROUND(B1437*0.25,0)","v":120}]
[null,{"$f":"B1437","v":481},"Lunch",{"$f":"ROUND(B1437*0.3,0)","v":144}]
[null,{"$f":"B1437","v":481},"Dinner",{"$f":"ROUND(B1437*0.45,0)","v":216},null,{"$f":"(D1438+D1437+D1439)","v":480},{"$f":"(D1438+D1437+D1439)-F1439","v":0}]
[null,482,"Breakfast",{"$f":"ROUND(B1440*0.25,0)","v":121}]
[null,{"$f":"B1440","v":482},"Lunch",{"$f":"ROUND(B1440*0.3,0)","v":145}]
[null,{"$f":"B1440","v":482},"Dinner",{"$f":"ROUND(B1440*0.45,0)","v":217},null,{"$f":"(D1441+D1440+D1442)","v":483},{"$f":"(D1441+D1440+D1442)-F1442","v":0}]
[null,483,"Breakfast",{"$f":"ROUND(B1443*0.25,0)","v":121}]
[null,{"$f":"B1443","v":483},"Lunch",{"$f":"ROUND(B1443*0.3,0)","v":145}]
[null,{"$f":"B1443","v":483},"Dinner",{"$f":"ROUND(B1443*0.45,0)","v":217},null,{"$f":"(D1444+D1443+D1445)","v":483},{"$f":"(D1444+D1443+D1445)-F1445","v":0}]
[null,484,"Breakfast",{"$f":"ROUND(B1446*0.25,0)","v":121}]
[null,{"$f":"B1446","v":484},"Lunch",{"$f":"ROUND(B1446*0.3,0)","v":145}]
[null,{"$f":"B1446","v":484},"Dinner",{"$f":"ROUND(B1446*0.45,0)","v":218},null,{"$f":"(D1447+D1446+D1448)","v":484},{"$f":"(D1447+D1446+D1448)-F1448","v":0}]
[null,485,"Breakfast",{"$f":"ROUND(B1449*0.25,0)","v":121}]
[null,{"$f":"B1449","v":485},"Lunch",{"$f":"ROUND(B1449*0.3,0)","v":146}]
[null,{"$f":"B1449","v":485},"Dinner",{"$f":"ROUND(B1449*0.45,0)","v":218},null,{"$f":"(D1450+D1449+D1451)","v":485},{"$f":"(D1450+D1449+D1451)-F1451","v":0}]
[null,486,"Breakfast",{"$f":"ROUND(B1452*0.25,0)","v":122}]
[null,{"$f":"B1452","v":486},"Lunch",{"$f":"ROUND(B1452*0.3,0)","v":146}]
[null,{"$f":"B1452","v":486},"Dinner",{"$f":"ROUND(B1452*0.45,0)","v":219},null,{"$f":"(D1453+D1452+D1454)","v":487},{"$f":"(D1453+D1452+D1454)-F1454","v":0}]
[null,487,"Breakfast",{"$f":"ROUND(B1455*0.25,0)","v":122}]
[null,{"$f":"B1455","v":487},"Lunch",{"$f":"ROUND(B1455*0.3,0)","v":146}]
[null,{"$f":"B1455","v":487},"Dinner",{"$f":"ROUND(B1455*0.45,0)","v":219},null,{"$f":"(D1456+D1455+D1457)","v":487},{"$f":"(D1456+D1455+D1457)-F1457","v":0}]
[null,488,"Breakfast",{"$f":"ROUND(B1458*0.25,0)","v":122}]
[null,{"$f":"B1458","v":488},"Lunch",{"$f":"ROUND(B1458*0.3,0)","v":146}]
[null,{"$f":"B1458","v":488},"Dinner",{"$f":"ROUND(B1458*0.45,0)","v":220},null,{"$f":"(D1459+D1458+D1460)","v":488},{"$f":"(D1459+D1458+D1460)-F1460","v":0}]
[null,489,"Breakfast",{"$f":"ROUND(B1461*0.25,0)","v":122}]
[null,{"$f":"B1461","v":489},"Lunch",{"$f":"ROUND(B1461*0.3,0)","v":147}]
[null,{"$f":"B1461","v":489},"Dinner",{"$f":"ROUND(B1461*0.45,0)","v":220},null,{"$f":"(D1462+D1461+D1463)","v":489},{"$f":"(D1462+D1461+D1463)-F1463","v":0}]
[null,490,"Breakfast",{"$f":"ROUND(B1464*0.25,0)","v":123}]
[null,{"$f":"B1464","v":490},"Lunch",{"$f":"ROUND(B1464*0.3,0)","v":147}]
[null,{"$f":"B1464","v":490},"Dinner",{"$f":"ROUND(B1464*0.45,0)","v":221},null,{"$f":"(D1465+D1464+D1466)","v":491},{"$f":"(D1465+D1464+D1466)-F1466","v":0}]
[null,491,"Breakfast",{"$f":"ROUND(B1467*0.25,0)","v":123}]
[null,{"$f":"B1467","v":491},"Lunch",{"$f":"ROUND(B1467*0.3,0)","v":147}]
[null,{"$f":"B1467","v":491},"Dinner",{"$f":"ROUND(B1467*0.45,0)","v":221},null,{"$f":"(D1468+D1467+D1469)","v":491},{"$f":"(D1468+D1467+D1469)-F1469","v":0}]
[null,492,"Breakfast",{"$f":"ROUND(B1470*0.25,0)","v":123}]
[null,{"$f":"B1470","v":492},"Lunch",{"$f":"ROUND(B1470*0.3,0)","v":148}]
[null,{"$f":"B1470","v":492},"Dinner",{"$f":"ROUND(B1470*0.45,0)","v":221},null,{"$f":"(D1471+D1470+D1472)","v":492},{"$f":"(D1471+D1470+D1472)-F1472","v":0}]
[null,493,"Breakfast",{"$f":"ROUND(B1473*0.25,0)","v":123}]
[null,{"$f":"B1473","v":493},"Lunch",{"$f":"ROUND(B1473*0.3,0)","v":148}]
[null,{"$f":"B1473","v":493},"Dinner",{"$f":"ROUND(B1473*0.45,0)","v":222},null,{"$f":"(D1474+D1473+D1475)","v":493},{"$f":"(D1474+D1473+D1475)-F1475","v":0}]
[null,494,"Breakfast",{"$f":"ROUND(B1476*0.25,0)","v":124}]
[null,{"$f":"B1476","v":494},"Lunch",{"$f":"ROUND(B1476*0.3,0)","v":148}]
[null,{"$f":"B1476","v":494},"Dinner",{"$f":"ROUND(B1476*0.45,0)","v":222},null,{"$f":"(D1477+D1476+D1478)","v":494},{"$f":"(D1477+D1476+D1478)-F1478","v":0}]
[null,495,"Breakfast",{"$f":"ROUND(B1479*0.25,0)","v":124}]
[null,{"$f":"B1479","v":495},"Lunch",{"$f":"ROUND(B1479*0.3,0)","v":149}]
[null,{"$f":"B1479","v":495},"Dinner",{"$f":"ROUND(B1479*0.45,0)","v":223},null,{"$f":"(D1480+D1479+D1481)","v":496},{"$f":"(D1480+D1479+D1481)-F1481","v":0}]
[null,496,"Breakfast",{"$f":"ROUND(B1482*0.25,0)","v":124}]
[null,{"$f":"B1482","v":496},"Lunch",{"$f":"ROUND(B1482*0.3,0)","v":149}]
[null,{"$f":"B1482","v":496},"Dinner",{"$f":"ROUND(B1482*0.45,0)","v":223},null,{"$f":"(D1483+D1482+D1484)","v":496},{"$f":"(D1483+D1482+D1484)-F1484","v":0}]
[null,497,"Breakfast",{"$f":"ROUND(B1485*0.25,0)","v":124}]
[null,{"$f":"B1485","v":497},"Lunch",{"$f":"ROUND(B1485*0.3,0)","v":149}]
[null,{"$f":"B1485","v":497},"Dinner",{"$f":"ROUND(B1485*0.45,0)","v":224},null,{"$f":"(D1486+D1485+D1487)","v":497},{"$f":"(D1486+D1485+D1487)-F1487","v":0}]
[null,498,"Breakfast",{"$f":"ROUND(B1488*0.25,0)","v":125}]
[null,{"$f":"B1488","v":498},"Lunch",{"$f":"ROUND(B1488*0.3,0)","v":149}]
[null,{"$f":"B1488","v":498},"Dinner",{"$f":"ROUND(B1488*0.45,0)","v":224},null,{"$f":"(D1489+D1488+D1490)","v":498},{"$f":"(D1489+D1488+D1490)-F1490","v":0}]
[null,499,"Breakfast",{"$f":"ROUND(B1491*0.25,0)","v":125}]
[null,{"$f":"B1491","v":499},"Lunch",{"$f":"ROUND(B1491*0.3,0)","v":150}]
[null,{"$f":"B1491","v":499},"Dinner",{"$f":"ROUND(B1491*0.45,0)","v":225},null,{"$f":"(D1492+D1491+D1493)","v":500},{"$f":"(D1492+D1491+D1493)-F1493","v":0}]
[null,500,"Breakfast",{"$f":"ROUND(B1494*0.25,0)","v":125}]
[null,{"$f":"B1494","v":500},"Lunch",{"$f":"ROUND(B1494*0.3,0)","v":150}]
[null,{"$f":"B1494","v":500},"Dinner",{"$f":"ROUND(B1494*0.45,0)","v":225},null,{"$f":"(D1495+D1494+D1496)","v":500},{"$f":"(D1495+D1494+D1496)-F1496","v":0}]
[null,501,"Breakfast",{"$f":"ROUND(B1497*0.25,0)","v":125}]
[null,{"$f":"B1497","v":501},"Lunch",{"$f":"ROUND(B1497*0.3,0)","v":150}]
[null,{"$f":"B1497","v":501},"Dinner",{"$f":"ROUND(B1497*0.45,0)","v":225},null,{"$f":"(D1498+D1497+D1499)","v":500},{"$f":"(D1498+D1497+D1499)-F1499","v":0}]
[null,502,"Breakfast",{"$f":"ROUND(B1500*0.25,0)","v":126}]
[null,502,"Lunch",{"$f":"ROUND(B1500*0.3,0)","v":151}]
[null,502,"Dinner",{"$f":"ROUND(B1500*0.45,0)","v":226},null,{"$f":"(D1501+D1500+D1502)","v":503},{"$f":"(D1501+D1500+D1502)-F1502","v":0}]
[null,503,"Breakfast",{"$f":"ROUND(B1503*0.25,0)","v":126}]
[null,503,"Lunch",{"$f":"ROUND(B1503*0.3,0)","v":151}]
[null,503,"Dinner",{"$f":"ROUND(B1503*0.45,0)","v":226},null,{"$f":"(D1504+D1503+D1505)","v":503},{"$f":"(D1504+D1503+D1505)-F1505","v":0}]
[null,504,"Breakfast",{"$f":"ROUND(B1506*0.25,0)","v":126}]
[null,504,"Lunch",{"$f":"ROUND(B1506*0.3,0)","v":151}]
[null,504,"Dinner",{"$f":"ROUND(B1506*0.45,0)","v":227},null,{"$f":"(D1507+D1506+D1508)","v":504},{"$f":"(D1507+D1506+D1508)-F1508","v":0}]
[null,505,"Breakfast",{"$f":"ROUND(B1509*0.25,0)","v":126}]
[null,505,"Lunch",{"$f":"ROUND(B1509*0.3,0)","v":152}]
[null,505,"Dinner",{"$f":"ROUND(B1509*0.45,0)","v":227},null,{"$f":"(D1510+D1509+D1511)","v":505},{"$f":"(D1510+D1509+D1511)-F1511","v":0}]
[null,506,"Breakfast",{"$f":"ROUND(B1512*0.25,0)","v":127}]
[null,506,"Lunch",{"$f":"ROUND(B1512*0.3,0)","v":152}]
[null,506,"Dinner",{"$f":"ROUND(B1512*0.45,0)","v":228},null,{"$f":"(D1513+D1512+D1514)","v":507},{"$f":"(D1513+D1512+D1514)-F1514","v":0}]
[null,507,"Breakfast",{"$f":"ROUND(B1515*0.25,0)","v":127}]
[null,507,"Lunch",{"$f":"ROUND(B1515*0.3,0)","v":152}]
[null,507,"Dinner",{"$f":"ROUND(B1515*0.45,0)","v":228},null,{"$f":"(D1516+D1515+D1517)","v":507},{"$f":"(D1516+D1515+D1517)-F1517","v":0}]
[null,508,"Breakfast",{"$f":"ROUND(B1518*0.25,0)","v":127}]
[null,508,"Lunch",{"$f":"ROUND(B1518*0.3,0)","v":152}]
[null,508,"Dinner",{"$f":"ROUND(B1518*0.45,0)","v":229},null,{"$f":"(D1519+D1518+D1520)","v":508},{"$f":"(D1519+D1518+D1520)-F1520","v":0}]
[null,509,"Breakfast",{"$f":"ROUND(B1521*0.25,0)","v":127}]
[null,509,"Lunch",{"$f":"ROUND(B1521*0.3,0)","v":153}]
[null,509,"Dinner",{"$f":"ROUND(B1521*0.45,0)","v":229},null,{"$f":"(D1522+D1521+D1523)","v":509},{"$f":"(D1522+D1521+D1523)-F1523","v":0}]
[null,510,"Breakfast",{"$f":"ROUND(B1524*0.25,0)","v":128}]
[null,510,"Lunch",{"$f":"ROUND(B1524*0.3,0)","v":153}]
[null,510,"Dinner",{"$f":"ROUND(B1524*0.45,0)","v":230},null,{"$f":"(D1525+D1524+D1526)","v":511},{"$f":"(D1525+D1524+D1526)-F1526","v":0}]
[null,511,"Breakfast",{"$f":"ROUND(B1527*0.25,0)","v":128}]
[null,511,"Lunch",{"$f":"ROUND(B1527*0.3,0)","v":153}]
[null,511,"Dinner",{"$f":"ROUND(B1527*0.45,0)","v":230},null,{"$f":"(D1528+D1527+D1529)","v":511},{"$f":"(D1528+D1527+D1529)-F1529","v":0}]
[null,512,"Breakfast",{"$f":"ROUND(B1530*0.25,0)","v":128}]
[null,512,"Lunch",{"$f":"ROUND(B1530*0.3,0)","v":154}]
[null,512,"Dinner",{"$f":"ROUND(B1530*0.45,0)","v":230},null,{"$f":"(D1531+D1530+D1532)","v":512},{"$f":"(D1531+D1530+D1532)-F1532","v":0}]
[null,513,"Breakfast",{"$f":"ROUND(B1533*0.25,0)","v":128}]
[null,513,"Lunch",{"$f":"ROUND(B1533*0.3,0)","v":154}]
[null,513,"Dinner",{"$f":"ROUND(B1533*0.45,0)","v":231},null,{"$f":"(D1534+D1533+D1535)","v":513},{"$f":"(D1534+D1533+D1535)-F1535","v":0}]
[null,514,"Breakfast",{"$f":"ROUND(B1536*0.25,0)","v":129}]
[null,514,"Lunch",{"$f":"ROUND(B1536*0.3,0)","v":154}]
[null,514,"Dinner",{"$f":"ROUND(B1536*0.45,0)","v":231},null,{"$f":"(D1537+D1536+D1538)","v":514},{"$f":"(D1537+D1536+D1538)-F1538","v":0}]
[null,515,"Breakfast",{"$f":"ROUND(B1539*0.25,0)","v":129}]
[null,515,"Lunch",{"$f":"ROUND(B1539*0.3,0)","v":155}]
[null,515,"Dinner",{"$f":"ROUND(B1539*0.45,0)","v":232},null,{"$f":"(D1540+D1539+D1541)","v":516},{"$f":"(D1540+D1539+D1541)-F1541","v":0}]
[null,516,"Breakfast",{"$f":"ROUND(B1542*0.25,0)","v":129}]
[null,516,"Lunch",{"$f":"ROUND(B1542*0.3,0)","v":155}]
[null,516,"Dinner",{"$f":"ROUND(B1542*0.45,0)","v":232},null,{"$f":"(D1543+D1542+D1544)","v":516},{"$f":"(D1543+D1542+D1544)-F1544","v":0}]
[null,517,"Breakfast",{"$f":"ROUND(B1545*0.25,0)","v":129}]
[null,517,"Lunch",{"$f":"ROUND(B1545*0.3,0)","v":155}]
[null,517,"Dinner",{"$f":"ROUND(B1545*0.45,0)","v":233},null,{"$f":"(D1546+D1545+D1547)","v":517},{"$f":"(D1546+D1545+D1547)-F1547","v":0}]
[null,518,"Breakfast",{"$f":"ROUND(B1548*0.25,0)","v":130}]
[null,518,"Lunch",{"$f":"ROUND(B1548*0.3,0)","v":155}]
[null,518,"Dinner",{"$f":"ROUND(B1548*0.45,0)","v":233},null,{"$f":"(D1549+D1548+D1550)","v":518},{"$f":"(D1549+D1548+D1550)-F1550","v":0}]
[null,519,"Breakfast",{"$f":"ROUND(B1551*0.25,0)","v":130}]
[null,519,"Lunch",{"$f":"ROUND(B1551*0.3,0)","v":156}]
[null,519,"Dinner",{"$f":"ROUND(B1551*0.45,0)","v":234},null,{"$f":"(D1552+D1551+D1553)","v":520},{"$f":"(D1552+D1551+D1553)-F1553","v":0}]
[null,520,"Breakfast",{"$f":"ROUND(B1554*0.25,0)","v":130}]
[null,520,"Lunch",{"$f":"ROUND(B1554*0.3,0)","v":156}]
[null,520,"Dinner",{"$f":"ROUND(B1554*0.45,0)","v":234},null,{"$f":"(D1555+D1554+D1556)","v":520},{"$f":"(D1555+D1554+D1556)-F1556","v":0}]
[null,521,"Breakfast",{"$f":"ROUND(B1557*0.25,0)","v":130}]
[null,521,"Lunch",{"$f":"ROUND(B1557*0.3,0)","v":156}]
[null,521,"Dinner",{"$f":"ROUND(B1557*0.45,0)","v":234},null,{"$f":"(D1558+D1557+D1559)","v":520},{"$f":"(D1558+D1557+D1559)-F1559","v":0}]
[null,522,"Breakfast",{"$f":"ROUND(B1560*0.25,0)","v":131}]
[null,522,"Lunch",{"$f":"ROUND(B1560*0.3,0)","v":157}]
[null,522,"Dinner",{"$f":"ROUND(B1560*0.45,0)","v":235},null,{"$f":"(D1561+D1560+D1562)","v":523},{"$f":"(D1561+D1560+D1562)-F1562","v":0}]
[null,523,"Breakfast",{"$f":"ROUND(B1563*0.25,0)","v":131}]
[null,{"$f":"B1563","v":523},"Lunch",{"$f":"ROUND(B1563*0.3,0)","v":157}]
[null,{"$f":"B1563","v":523},"Dinner",{"$f":"ROUND(B1563*0.45,0)","v":235},null,{"$f":"(D1564+D1563+D1565)","v":523},{"$f":"(D1564+D1563+D1565)-F1565","v":0}]
[null,524,"Breakfast",{"$f":"ROUND(B1566*0.25,0)","v":131}]
[null,524,"Lunch",{"$f":"ROUND(B1566*0.3,0)","v":157}]
[null,524,"Dinner",{"$f":"ROUND(B1566*0.45,0)","v":236},null,{"$f":"(D1567+D1566+D1568)","v":524},{"$f":"(D1567+D1566+D1568)-F1568","v":0}]
[null,525,"Breakfast",{"$f":"ROUND(B1569*0.25,0)","v":131}]
[null,525,"Lunch",{"$f":"ROUND(B1569*0.3,0)","v":158}]
[null,525,"Dinner",{"$f":"ROUND(B1569*0.45,0)","v":236},null,{"$f":"(D1570+D1569+D1571)","v":525},{"$f":"(D1570+D1569+D1571)-F1571","v":0}]
[null,526,"Breakfast",{"$f":"ROUND(B1572*0.25,0)","v":132}]
[null,526,"Lunch",{"$f":"ROUND(B1572*0.3,0)","v":158}]
[null,526,"Dinner",{"$f":"ROUND(B1572*0.45,0)","v":237},null,{"$f":"(D1573+D1572+D1574)","v":527},{"$f":"(D1573+D1572+D1574)-F1574","v":0}]
[null,527,"Breakfast",{"$f":"ROUND(B1575*0.25,0)","v":132}]
[null,527,"Lunch",{"$f":"ROUND(B1575*0.3,0)","v":158}]
[null,527,"Dinner",{"$f":"ROUND(B1575*0.45,0)","v":237},null,{"$f":"(D1576+D1575+D1577)","v":527},{"$f":"(D1576+D1575+D1577)-F1577","v":0}]
[null,528,"Breakfast",{"$f":"ROUND(B1578*0.25,0)","v":132}]
[null,528,"Lunch",{"$f":"ROUND(B1578*0.3,0)","v":158}]
[null,528,"Dinner",{"$f":"ROUND(B1578*0.45,0)","v":238},null,{"$f":"(D1579+D1578+D1580)","v":528},{"$f":"(D1579+D1578+D1580)-F1580","v":0}]
[null,529,"Breakfast",{"$f":"ROUND(B1581*0.25,0)","v":132}]
[null,529,"Lunch",{"$f":"ROUND(B1581*0.3,0)","v":159}]
[null,529,"Dinner",{"$f":"ROUND(B1581*0.45,0)","v":238},null,{"$f":"(D1582+D1581+D1583)","v":529},{"$f":"(D1582+D1581+D1583)-F1583","v":0}]
[null,530,"Breakfast",{"$f":"ROUND(B1584*0.25,0)","v":133}]
[null,530,"Lunch",{"$f":"ROUND(B1584*0.3,0)","v":159}]
[null,530,"Dinner",{"$f":"ROUND(B1584*0.45,0)","v":239},null,{"$f":"(D1585+D1584+D1586)","v":531},{"$f":"(D1585+D1584+D1586)-F1586","v":0}]
[null,531,"Breakfast",{"$f":"ROUND(B1587*0.25,0)","v":133}]
[null,531,"Lunch",{"$f":"ROUND(B1587*0.3,0)","v":159}]
[null,531,"Dinner",{"$f":"ROUND(B1587*0.45,0)","v":239},null,{"$f":"(D1588+D1587+D1589)","v":531},{"$f":"(D1588+D1587+D1589)-F1589","v":0}]
[null,532,"Breakfast",{"$f":"ROUND(B1590*0.25,0)","v":133}]
[null,532,"Lunch",{"$f":"ROUND(B1590*0.3,0)","v":160}]
[null,532,"Dinner",{"$f":"ROUND(B1590*0.45,0)","v":239},null,{"$f":"(D1591+D1590+D1592)","v":532},{"$f":"(D1591+D1590+D1592)-F1592","v":0}]
[null,533,"Breakfast",{"$f":"ROUND(B1593*0.25,0)","v":133}]
[null,533,"Lunch",{"$f":"ROUND(B1593*0.3,0)","v":160}]
[null,533,"Dinner",{"$f":"ROUND(B1593*0.45,0)","v":240},null,{"$f":"(D1594+D1593+D1595)","v":533},{"$f":"(D1594+D1593+D1595)-F1595","v":0}]
[null,534,"Breakfast",{"$f":"ROUND(B1596*0.25,0)","v":134}]
[null,534,"Lunch",{"$f":"ROUND(B1596*0.3,0)","v":160}]
[null,534,"Dinner",{"$f":"ROUND(B1596*0.45,0)","v":240},null,{"$f":"(D1597+D1596+D1598)","v":534},{"$f":"(D1597+D1596+D1598)-F1598","v":0}]
[null,535,"Breakfast",{"$f":"ROUND(B1599*0.25,0)","v":134}]
[null,535,"Lunch",{"$f":"ROUND(B1599*0.3,0)","v":161}]
[null,535,"Dinner",{"$f":"ROUND(B1599*0.45,0)","v":241},null,{"$f":"(D1600+D1599+D1601)","v":536},{"$f":"(D1600+D1599+D1601)-F1601","v":0}]
[null,536,"Breakfast",{"$f":"ROUND(B1602*0.25,0)","v":134}]
[null,536,"Lunch",{"$f":"ROUND(B1602*0.3,0)","v":161}]
[null,536,"Dinner",{"$f":"ROUND(B1602*0.45,0)","v":241},null,{"$f":"(D1603+D1602+D1604)","v":536},{"$f":"(D1603+D1602+D1604)-F1604","v":0}]
[null,537,"Breakfast",{"$f":"ROUND(B1605*0.25,0)","v":134}]
[null,537,"Lunch",{"$f":"ROUND(B1605*0.3,0)","v":161}]
[null,537,"Dinner",{"$f":"ROUND(B1605*0.45,0)","v":242},null,{"$f":"(D1606+D1605+D1607)","v":537},{"$f":"(D1606+D1605+D1607)-F1607","v":0}]
[null,538,"Breakfast",{"$f":"ROUND(B1608*0.25,0)","v":135}]
[null,538,"Lunch",{"$f":"ROUND(B1608*0.3,0)","v":161}]
[null,538,"Dinner",{"$f":"ROUND(B1608*0.45,0)","v":242},null,{"$f":"(D1609+D1608+D1610)","v":538},{"$f":"(D1609+D1608+D1610)-F1610","v":0}]
[null,539,"Breakfast",{"$f":"ROUND(B1611*0.25,0)","v":135}]
[null,539,"Lunch",{"$f":"ROUND(B1611*0.3,0)","v":162}]
[null,539,"Dinner",{"$f":"ROUND(B1611*0.45,0)","v":243},null,{"$f":"(D1612+D1611+D1613)","v":540},{"$f":"(D1612+D1611+D1613)-F1613","v":0}]
[null,540,"Breakfast",{"$f":"ROUND(B1614*0.25,0)","v":135}]
[null,540,"Lunch",{"$f":"ROUND(B1614*0.3,0)","v":162}]
[null,540,"Dinner",{"$f":"ROUND(B1614*0.45,0)","v":243},null,{"$f":"(D1615+D1614+D1616)","v":540},{"$f":"(D1615+D1614+D1616)-F1616","v":0}]
[null,541,"Breakfast",{"$f":"ROUND(B1617*0.25,0)","v":135}]
[null,541,"Lunch",{"$f":"ROUND(B1617*0.3,0)","v":162}]
[null,541,"Dinner",{"$f":"ROUND(B1617*0.45,0)","v":243},null,{"$f":"(D1618+D1617+D1619)","v":540},{"$f":"(D1618+D1617+D1619)-F1619","v":0}]
[null,542,"Breakfast",{"$f":"ROUND(B1620*0.25,0)","v":136}]
[null,542,"Lunch",{"$f":"ROUND(B1620*0.3,0)","v":163}]
[null,542,"Dinner",{"$f":"ROUND(B1620*0.45,0)","v":244},null,{"$f":"(D1621+D1620+D1622)","v":543},{"$f":"(D1621+D1620+D1622)-F1622","v":0}]
[null,543,"Breakfast",{"$f":"ROUND(B1623*0.25,0)","v":136}]
[null,543,"Lunch",{"$f":"ROUND(B1623*0.3,0)","v":163}]
[null,543,"Dinner",{"$f":"ROUND(B1623*0.45,0)","v":244},null,{"$f":"(D1624+D1623+D1625)","v":543},{"$f":"(D1624+D1623+D1625)-F1625","v":0}]
[null,544,"Breakfast",{"$f":"ROUND(B1626*0.25,0)","v":136}]
[null,544,"Lunch",{"$f":"ROUND(B1626*0.3,0)","v":163}]
[null,544,"Dinner",{"$f":"ROUND(B1626*0.45,0)","v":245},null,{"$f":"(D1627+D1626+D1628)","v":544},{"$f":"(D1627+D1626+D1628)-F1628","v":0}]
[null,545,"Breakfast",{"$f":"ROUND(B1629*0.25,0)","v":136}]
[null,{"$f":"B1629","v":545},"Lunch",{"$f":"ROUND(B1629*0.3,0)","v":164}]
[null,{"$f":"B1629","v":545},"Dinner",{"$f":"ROUND(B1629*0.45,0)","v":245},null,{"$f":"(D1630+D1629+D1631)","v":545},{"$f":"(D1630+D1629+D1631)-F1631","v":0}]
[null,546,"Breakfast",{"$f":"ROUND(B1632*0.25,0)","v":137}]
[null,546,"Lunch",{"$f":"ROUND(B1632*0.3,0)","v":164}]
[null,546,"Dinner",{"$f":"ROUND(B1632*0.45,0)","v":246},null,{"$f":"(D1633+D1632+D1634)","v":547},{"$f":"(D1633+D1632+D1634)-F1634","v":0}]
[null,547,"Breakfast",{"$f":"ROUND(B1635*0.25,0)","v":137}]
[null,547,"Lunch",{"$f":"ROUND(B1635*0.3,0)","v":164}]
[null,547,"Dinner",{"$f":"ROUND(B1635*0.45,0)","v":246},null,{"$f":"(D1636+D1635+D1637)","v":547},{"$f":"(D1636+D1635+D1637)-F1637","v":0}]
[null,548,"Breakfast",{"$f":"ROUND(B1638*0.25,0)","v":137}]
[null,548,"Lunch",{"$f":"ROUND(B1638*0.3,0)","v":164}]
[null,548,"Dinner",{"$f":"ROUND(B1638*0.45,0)","v":247},null,{"$f":"(D1639+D1638+D1640)","v":548},{"$f":"(D1639+D1638+D1640)-F1640","v":0}]
[null,549,"Breakfast",{"$f":"ROUND(B1641*0.25,0)","v":137}]
[null,549,"Lunch",{"$f":"ROUND(B1641*0.3,0)","v":165}]
[null,549,"Dinner",{"$f":"ROUND(B1641*0.45,0)","v":247},null,{"$f":"(D1642+D1641+D1643)","v":549},{"$f":"(D1642+D1641+D1643)-F1643","v":0}]
[null,550,"Breakfast",{"$f":"ROUND(B1644*0.25,0)","v":138}]
[null,550,"Lunch",{"$f":"ROUND(B1644*0.3,0)","v":165}]
[null,550,"Dinner",{"$f":"ROUND(B1644*0.45,0)","v":248},null,{"$f":"(D1645+D1644+D1646)","v":551},{"$f":"(D1645+D1644+D1646)-F1646","v":0}]
[null,551,"Breakfast",{"$f":"ROUND(B1647*0.25,0)","v":138}]
[null,551,"Lunch",{"$f":"ROUND(B1647*0.3,0)","v":165}]
[null,551,"Dinner",{"$f":"ROUND(B1647*0.45,0)","v":248},null,{"$f":"(D1648+D1647+D1649)","v":551},{"$f":"(D1648+D1647+D1649)-F1649","v":0}]
[null,552,"Breakfast",{"$f":"ROUND(B1650*0.25,0)","v":138}]
[null,552,"Lunch",{"$f":"ROUND(B1650*0.3,0)","v":166}]
[null,552,"Dinner",{"$f":"ROUND(B1650*0.45,0)","v":248},null,{"$f":"(D1651+D1650+D1652)","v":552},{"$f":"(D1651+D1650+D1652)-F1652","v":0}]
[null,553,"Breakfast",{"$f":"ROUND(B1653*0.25,0)","v":138}]
[null,553,"Lunch",{"$f":"ROUND(B1653*0.3,0)","v":166}]
[null,553,"Dinner",{"$f":"ROUND(B1653*0.45,0)","v":249},null,{"$f":"(D1654+D1653+D1655)","v":553},{"$f":"(D1654+D1653+D1655)-F1655","v":0}]
[null,554,"Breakfast",{"$f":"ROUND(B1656*0.25,0)","v":139}]
[null,554,"Lunch",{"$f":"ROUND(B1656*0.3,0)","v":166}]
[null,554,"Dinner",{"$f":"ROUND(B1656*0.45,0)","v":249},null,{"$f":"(D1657+D1656+D1658)","v":554},{"$f":"(D1657+D1656+D1658)-F1658","v":0}]
[null,555,"Breakfast",{"$f":"ROUND(B1659*0.25,0)","v":139}]
[null,555,"Lunch",{"$f":"ROUND(B1659*0.3,0)","v":167}]
[null,555,"Dinner",{"$f":"ROUND(B1659*0.45,0)","v":250},null,{"$f":"(D1660+D1659+D1661)","v":556},{"$f":"(D1660+D1659+D1661)-F1661","v":0}]

{"sheet":"Formula","index":2,"n_rows":27,"n_cols":6,"rows_kept":27,"cut":false,"hidden":true,"merged":[]}
["Part","Code","Price","Find Part","Find Code"]
["x",11,5,"y",12,{"$f":"INDEX($C$2:$C$5,MATCH(D2,IF($B$2:$B$5=E2,$A$2:$A$5),0))","v":8}]
["x",12,6,"y",11,"=INDEX($C$2:$C$5,MATCH(D2,IF($B$2:$B$5=E2,$A$2:$A$5),0))"]
["y",11,7,"x",12,"ctrl + shift + enter"]
["y",12,8,"x",11]
[null,null,null,null,null,"https://support.microsoft.com/en-us/kb/214142"]
[null,null,null,null,null,"http://thinketg.com/say-goodbye-to-vlookup-and-hello-to-index-match/"]
[]
[]
["VBA Code"]
["CommandButton1"]
[]
["Private Sub CommandButton1_Click()"]
["Sheets(\"Calculation\").Range(\"C4\").Value = \"Yes\""]
["Sheets(\"Calculation\").Range(\"C5\").Value = \"1\""]
["Sheets(\"Calculation\").Range(\"C7\").Value = \"10\""]
["Sheets(\"Calculation\").Range(\"C8\").Value = \"Dinner\""]
["Sheets(\"Calculation\").Range(\"C11\").Value = \"0\""]
["Sheets(\"Calculation\").Range(\"C13\").Value = \"1\""]
["Sheets(\"Calculation\").Range(\"C14\").Value = \"1\""]
["Sheets(\"Calculation\").Range(\"C16\").Value = \"1\""]
["Sheets(\"Calculation\").Range(\"C20\").Value = \"No\""]
["Sheets(\"Calculation\").Range(\"C21\").Value = \"0\""]
[]
["MsgBox \"Form has been reset.\""]
[]
["End Sub"]