{"text_format":"1","workbook":"xlsx","n_sheets":3,"sheets":["Calculation","Per Diem Rates","Formula"],"not_rendered":{"charts":0,"images":1,"macros":1,"external_links":0,"defined_names":0,"comments":1,"pivot_tables":0},"unopened":[],"bounds":{"document_bytes":16777216,"sheet_cells":100000,"rows_first":2000,"rows_last":500,"rows_between":2000,"halvings":0,"cell_chars":16384,"cell_head_chars":4096},"cells_cut":0,"cells_raw":0,"read":"whole","date_system":"1900"}

{"sheet":"Calculation","index":0,"n_rows":75,"n_cols":10,"rows_kept":75,"cut":false,"hidden":false,"merged":[[84,4,84,8],[84,9,84,12],[29,4,29,12],[81,4,81,8],[81,9,81,12],[82,4,82,8],[82,9,82,12],[83,4,83,8],[83,9,83,12],[78,4,78,8],[78,9,78,12],[79,4,79,8],[79,9,79,12],[80,4,80,8],[80,9,80,12],[75,4,75,8],[75,9,75,12],[76,4,76,8],[76,9,76,12],[77,4,77,8],[77,9,77,12],[72,4,72,8],[72,9,72,12],[73,4,73,8],[73,9,73,12],[74,4,74,8],[74,9,74,12],[69,4,69,8],[69,9,69,12],[70,4,70,8],[70,9,70,12],[71,4,71,8],[71,9,71,12],[66,4,66,8],[66,9,66,12],[67,4,67,8],[67,9,67,12],[68,4,68,8],[68,9,68,12],[63,4,63,8],[63,9,63,12],[64,4,64,8],[64,9,64,12],[65,4,65,8],[65,9,65,12],[60,4,60,8],[60,9,60,12],[61,4,61,8],[61,9,61,12],[62,4,62,8],[62,9,62,12],[57,4,57,8],[57,9,57,12],[58,4,58,8],[58,9,58,12],[59,4,59,8],[59,9,59,12],[54,4,54,8],[54,9,54,12],[55,4,55,8],[55,9,55,12],[56,4,56,8],[56,9,56,12],[50,4,50,8],[50,9,50,12],[51,4,51,8],[51,9,51,12],[52,4,52,8],[52,9,52,12],[53,4,53,8],[53,9,53,12],[47,4,47,8],[47,9,47,12],[48,4,48,8],[48,9,48,12],[49,4,49,8],[49,9,49,12],[44,4,44,8],[44,9,44,12],[45,4,45,8],[45,9,45,12],[46,4,46,8],[46,9,46,12],[42,9,42,12],[43,9,43,12],[36,4,36,8],[37,4,37,8],[38,4,38,8],[39,4,39,8],[40,4,40,8],[41,4,41,8],[42,4,42,8],[43,4,43,8],[37,9,37,12],[38,9,38,12],[39,9,39,12],[40,9,40,12],[41,9,41,12],[35,4,35,8],[35,9,35,12],[36,9,36,12],[26,7,26,12],[23,7,23,12],[30,4,32,12],[33,5,33,12],[34,4,34,5],[34,6,34,12]]}
[null,null,null,null,"Ariba won't accept this specific excel filetype as an attachment."]
[null,null,null,null,"Please save as PDF or print>scan, and attach to the expense report."]
[]
[null,"Traveler included in meal ?","Yes",null,{"$f":"IF(C20=\"no\",\"     Tax Charged\",\"\")","v":"     Tax Charged"},{"$f":"IF(C20=\"No\",C14,\"\")","v":1}]
[null,"Number of all \"other\" participants, all must be on Travel Status",1,null,null,{"$f":"IF(C20=\"No\",C13,\"\")","v":1}]
[null,null,null,null,{"$f":"IF(C20=\"no\",\"     Tax Rate\",\"\")","v":"     Tax Rate"},{"$f":"IF(C20=\"No\",(F4/F5),\"\")","v":1}]
[null,"Meal per diem rate for travel location",10]
[null,"Meal purchased","Dinner",null,{"$f":"IF(C20=\"no\",\"     ( Sub Total - Alcohol )\",\"     ( Total - Alcohol )\")","v":"     ( Sub Total - Alcohol )"},{"$f":"IF(C20=\"No\",C13,C21)","v":1},"-",{"$f":"IF(C20=\"No\",C11,C11)","v":0},"=",{"$f":"IF(C20=\"No\",(F8-H8),(F8-H8))","v":1}]
[null,"Per Diem Rate",{"$f":"INDEX('Per Diem Rates'!$D$3:$D$1661,MATCH(Calculation!C7,IF('Per Diem Rates'!$C$3:$C$1661=Calculation!C8,'Per Diem Rates'!$B$3:$B$1661),0))","v":5},null,{"$f":"IF(C20=\"no\",\"     ( 1 + Tax Rate )\",\"\")","v":"     ( 1 + Tax Rate )"},{"$f":"IF(C20=\"no\",1,\"\")","v":1},{"$f":"IF(C20=\"no\",\"+\",\"\")","v":"+"},{"$f":"IF(C20=\"No\",F6,\"\")","v":1},{"$f":"IF(C20=\"no\",\"=\",\"\")","v":"="},{"$f":"IF(C20=\"No\",(F9+H9),\"\")","v":2}]
[null,null,null,null,"     Claimed",null,null,null,null,{"$f":"IF(C20=\"No\",(J8*J9),(J8))","v":2}]
[null,"Alcohol",0]
[null,null,null,null,"     Claimed",{"$f":"IF(C20=\"No\",J10,J10)","v":2}]
[null,{"$f":"IF(C20=\"Yes\",\"Calculation uses data in yellow cells below, disregard this cell >\",\"Sub Total\")","v":"Sub Total"},1,null," +  Tip",{"$f":"IF(C20=\"No\",C16,C22)","v":1}]
[null,{"$f":"IF(C20=\"Yes\",\"Calculation uses data in yellow cells below, disregard this cell >\",\"Tax Charged\")","v":"Tax Charged"},1,null," -  Traveler's Per Diem",{"$f":"IF(C4=\"No\",0,C9)","v":5}]
[null,{"$f":"IF(C20=\"Yes\",\"Calculation uses data in yellow cells below, disregard this cell >\",\"Total\")","v":"Total"},{"$f":"C13+C14","v":2},null,"     MPO Claimed",{"$f":"IF((F12+F13-F14)<0,0,(F12+F13-F14))","v":0}]
[null,{"$f":"IF(C20=\"Yes\",\"Calculation uses data in yellow cells below, disregard this cell >\",\"Tip\")","v":"Tip"},1]
[null,null,null,null,"     MPO Claimed",{"$f":"F15","v":0}]
[null,"Grand Total",{"$f":"IF(C20=\"yes\",(C21+C22),(C13+C14+C16))","v":3},null," /  # of Participants",{"$f":"C5","v":1}]
[null,null,null,null,"     Average Meal Cost",{"$f":"F17/F18","v":0}]
[null,"Receipt ONLY shows Total & Tip ?","No"]
[null,{"$f":"IF(C20=\"Yes\",\"Total\",\"Calculation uses data in blue cells above, disregard this cell >\")","v":"Calculation uses data in blue cells above, disregard this cell >"},0,null,"Per Diem Rate Violation",{"$f":"IF(F19<C9, \"No\", \"Yes\")","v":"No"}]
[null,{"$f":"IF(C20=\"Yes\",\"Tip\",\"Calculation uses data in blue cells above, disregard this cell >\")","v":"Calculation uses data in blue cells above, disregard this cell >"},0]
[null,null,null,null,"Meals Paid for Others"]
[null,"I N S T R U C T I O N S",null,null,"Reimbursable",{"$f":"IF(F19<C9, (F19*C5), (C9*C5))","v":0},">","Reimbursed on the Meals Paid for Others line."]
[null,"◊ Choose Yes/No regarding the Traveler's participation",null,null,"Over Per Diem",{"$f":"IF(C4=\"No\",IF(F15<=0,0,(MAX(0,(F19*C5)-(C9*C5)))),IF(F19<C9,0,((F19*C5)-(C9*C5))))","v":0},">","Only on a 64x budget with a UW business reason."]
[null,"◊ Enter the # of Participants, DO NOT include the traveler",null,null,"Alcohol",{"$f":"IF(C20=\"No\", (C11*(1+F6)), (C11))","v":0},">","Includes tax, alcohol taxes for location is unknown."]
[null,null,null,null,"Traveler Per Diem",{"$f":"IF(C4=\"No\",0,IF(C20=\"yes\",IF(F12+F13<C9,F12+F13,C9),IF(F12+F13<C9,F12+F13,C9)))","v":3},">","Reimburse on the Traveler's Per Diem Meals line."]
[null,"◊ Select the total allowed per diem for travel location. ",null,null,"Grand Total",{"$f":"F24+F26+F25+F27","v":3}]
[null,"This information can be found on the GSA site"]
[null,"http://www.gsa.gov/portal/content/104877",null,null,"UW Business Reason :"]
[null,"and attach proof to the expense report.",null,null,"[[ Enter information ]]"]
[null,"◊ Select the claimed meal."]
[null,"◊ The per diem rate for the location and meal will auto-calculate."]
[null,"Meal breakdown is 25% for breakfast.",null,null,"Name of Traveler :","[[ Enter information ]]"]
[null,"Meal breakdown is 30% for lunch.",null,null,"Location of Meal (City, State) :",null,"[[ Enter information ]]"]
[null,"Meal breakdown is 45% for dinner.",null,null,"Participant Name :",null,null,null,null,"Duty/Home Station (City, State) :"]
[null,null,null,null,"[[ Enter information ]]",null,null,null,null,"[[ Enter information ]]"]
[null,"◊ Enter the total for alcohol.",null,null,""]
[null,null,null,null,""]
[null,"◊ Enter the sub total found on the receipt.",null,null,""]
[null,"The sub total should include all alcohol expenses.",null,null,""]
[null,"◊ Enter the taxes charged on the sub total, found on the receipt.",null,null,""]
[null,"If the alcohol is charged separate taxes, do not include.",null,null,""]
[null,"◊ Enter the total found on the receipt. ",null,null,""]
[null,"◊ Enter the tip amount.",null,null,""]
[null,"Tips are an incidental cost.",null,null,""]
[null,"Incidentals are included in the meals per diem rate.",null,null,""]
[null,null,null,null,""]
[null,"◊ The Grand Total should be the sum of the receipt total and tip.",null,null,""]
[null,"Utilize this data to double check that inputs are correct.",null,null,""]
[null,null,null,null,""]
[null,"◊ Choose Yes if the receipt doesn't show the sub-total or taxes.",null,null,""]
[null,"Receipt must still be itemized for food items.",null,null,""]
[null,"Receipt only shows the grand total ?",null,null,""]
[null,"No sub-total and tax calculation available ?",null,null,""]
[null,"Select Yes, and enter the amounts below.",null,null,""]
[null,"◊ If Yes is selected above, enter the total.",null,null,""]
[null,"◊ If Yes is selected above, enter the tip amount.",null,null,""]
[null,null,null,null,""]
[null,null,null,null,""]
[null,null,null,null,""]
[null,null,null,null,""]
[null,null,null,null,""]
[null,null,null,null,""]
[null,null,null,null,""]
[null,null,null,null,""]
[null,null,null,null,""]
[null,null,null,null,""]
[null,null,null,null,""]
[null,null,null,null,""]
[null,null,null,null,""]
[null,null,null,null,""]
[null,null,null,null,""]
[null,null,null,null,""]
[null,null,null,null,""]

{"sheet":"Per Diem Rates","index":1,"n_rows":1661,"n_cols":13,"rows_kept":1661,"cut":false,"hidden":true,"merged":[]}
[]
[null,"Per Diem Daily Limit","Meal","Per Diem Allowance",null,"Total","Ariba Chk",null,"Data V #1",null,"Data V #2",null,"Data V #3"]
[null,3,"Breakfast",{"$f":"ROUND(B3*0.25,0)","v":1},null,null,null,null,"Breakfast",null,3,null,"Yes"]
[null,{"$f":"B3","v":3},"Lunch",{"$f":"ROUND(B3*0.3,0)","v":1},null,null,null,null,"Lunch",null,4,null,"No"]
[null,{"$f":"B3","v":3},"Dinner",{"$f":"ROUND(B3*0.45,0)","v":1},null,{"$f":"(D4+D3+D5)","v":3},{"$f":"(D4+D3+D5)-F5","v":0},null,"Dinner",null,5]
[null,4,"Breakfast",{"$f":"ROUND(B6*0.25,0)","v":1},null,null,null,null,null,null,6]
[null,{"$f":"B6","v":4},"Lunch",{"$f":"ROUND(B6*0.3,0)","v":1},null,null,null,null,null,null,7]
[null,{"$f":"B6","v":4},"Dinner",{"$f":"ROUND(B6*0.45,0)","v":2},null,{"$f":"(D7+D6+D8)","v":4},{"$f":"(D7+D6+D8)-F8","v":0},null,null,null,8]
[null,5,"Breakfast",{"$f":"ROUND(B9*0.25,0)","v":1},null,null,null,null,null,null,9]
[null,{"$f":"B9","v":5},"Lunch",{"$f":"ROUND(B9*0.3,0)","v":2},null,null,null,null,null,null,10]
[null,{"$f":"B9","v":5},"Dinner",{"$f":"ROUND(B9*0.45,0)","v":2},null,{"$f":"(D10+D9+D11)","v":5},{"$f":"(D10+D9+D11)-F11","v":0},null,null,null,11]
[null,6,"Breakfast",{"$f":"ROUND(B12*0.25,0)","v":2},null,null,null,null,null,null,12]
[null,{"$f":"B12","v":6},"Lunch",{"$f":"ROUND(B12*0.3,0)","v":2},null,null,null,null,null,null,13]
[null,{"$f":"B12","v":6},"Dinner",{"$f":"ROUND(B12*0.45,0)","v":3},null,{"$f":"(D13+D12+D14)","v":7},{"$f":"(D13+D12+D14)-F14","v":0},null,null,null,14]
[null,7,"Breakfast",{"$f":"ROUND(B15*0.25,0)","v":2},null,null,null,null,null,null,15]
[null,{"$f":"B15","v":7},"Lunch",{"$f":"ROUND(B15*0.3,0)","v":2},null,null,null,null,null,null,16]
[null,{"$f":"B15","v":7},"Dinner",{"$f":"ROUND(B15*0.45,0)","v":3},null,{"$f":"(D16+D15+D17)","v":7},{"$f":"(D16+D15+D17)-F17","v":0},null,null,null,17]
[null,8,"Breakfast",{"$f":"ROUND(B18*0.25,0)","v":2},null,null,null,null,null,null,18]
[null,{"$f":"B18","v":8},"Lunch",{"$f":"ROUND(B18*0.3,0)","v":2},null,null,null,null,null,null,19]
[null,{"$f":"B18","v":8},"Dinner",{"$f":"ROUND(B18*0.45,0)","v":4},null,{"$f":"(D19+D18+D20)","v":8},{"$f":"(D19+D18+D20)-F20","v":0},null,null,null,20]
[null,9,"Breakfast",{"$f":"ROUND(B21*0.25,0)","v":2},null,null,null,null,null,null,21]
[null,{"$f":"B21","v":9},"Lunch",{"$f":"ROUND(B21*0.3,0)","v":3},null,null,null,null,null,null,22]
[null,{"$f":"B21","v":9},"Dinner",{"$f":"ROUND(B21*0.45,0)","v":4},null,{"$f":"(D22+D21+D23)","v":9},{"$f":"(D22+D21+D23)-F23","v":0},null,null,null,23]
[null,10,"Breakfast",{"$f":"ROUND(B24*0.25,0)","v":3},null,null,null,null,null,null,24]
[null,{"$f":"B24","v":10},"Lunch",{"$f":"ROUND(B24*0.3,0)","v":3},null,null,null,null,null,null,25]
[null,{"$f":"B24","v":10},"Dinner",{"$f":"ROUND(B24*0.45,0)","v":5},null,{"$f":"(D25+D24+D26)","v":11},{"$f":"(D25+D24+D26)-F26","v":0},null,null,null,26]
[null,11,"Breakfast",{"$f":"ROUND(B27*0.25,0)","v":3},null,null,null,null,null,null,27]
[null,{"$f":"B27","v":11},"Lunch",{"$f":"ROUND(B27*0.3,0)","v":3},null,null,null,null,null,null,28]
[null,{"$f":"B27","v":11},"Dinner",{"$f":"ROUND(B27*0.45,0)","v":5},null,{"$f":"(D28+D27+D29)","v":11},{"$f":"(D28+D27+D29)-F29","v":0},null,null,null,29]
[null,12,"Breakfast",{"$f":"ROUND(B30*0.25,0)","v":3},null,null,null,null,null,null,30]
[null,{"$f":"B30","v":12},"Lunch",{"$f":"ROUND(B30*0.3,0)","v":4},null,null,null,null,null,null,31]
[null,{"$f":"B30","v":12},"Dinner",{"$f":"ROUND(B30*0.45,0)","v":5},null,{"$f":"(D31+D30+D32)","v":12},{"$f":"(D31+D30+D32)-F32","v":0},null,null,null,32]
[null,13,"Breakfast",{"$f":"ROUND(B33*0.25,0)","v":3},null,null,null,null,null,null,33]
[null,{"$f":"B33","v":13},"Lunch",{"$f":"ROUND(B33*0.3,0)","v":4},null,null,null,null,null,null,34]
[null,{"$f":"B33","v":13},"Dinner",{"$f":"ROUND(B33*0.45,0)","v":6},null,{"$f":"(D34+D33+D35)","v":13},{"$f":"(D34+D33+D35)-F35","v":0},null,null,null,35]
[null,14,"Breakfast",{"$f":"ROUND(B36*0.25,0)","v":4},null,null,null,null,null,null,36]
[null,{"$f":"B36","v":14},"Lunch",{"$f":"ROUND(B36*0.3,0)","v":4},null,null,null,null,null,null,37]
[null,{"$f":"B36","v":14},"Dinner",{"$f":"ROUND(B36*0.45,0)","v":6},null,{"$f":"(D37+D36+D38)","v":14},{"$f":"(D37+D36+D38)-F38","v":0},null,null,null,38]
[null,15,"Breakfast",{"$f":"ROUND(B39*0.25,0)","v":4},null,null,null,null,null,null,39]
[null,{"$f":"B39","v":15},"Lunch",{"$f":"ROUND(B39*0.3,0)","v":5},null,null,null,null,null,null,40]
[null,{"$f":"B39","v":15},"Dinner",{"$f":"ROUND(B39*0.45,0)","v":7},null,{"$f":"(D40+D39+D41)","v":16},{"$f":"(D40+D39+D41)-F41","v":0},null,null,null,41]
[null,16,"Breakfast",{"$f":"ROUND(B42*0.25,0)","v":4},null,null,null,null,null,null,42]
[null,{"$f":"B42","v":16},"Lunch",{"$f":"ROUND(B42*0.3,0)","v":5},null,null,null,null,null,null,43]
[null,{"$f":"B42","v":16},"Dinner",{"$f":"ROUND(B42*0.45,0)","v":7},null,{"$f":"(D43+D42+D44)","v":16},{"$f":"(D43+D42+D44)-F44","v":0},null,null,null,44]
[null,17,"Breakfast",{"$f":"ROUND(B45*0.25,0)","v":4},null,null,null,null,null,null,45]
[null,{"$f":"B45","v":17},"Lunch",{"$f":"ROUND(B45*0.3,0)","v":5},null,null,null,null,null,null,46]
[null,{"$f":"B45","v":17},"Dinner",{"$f":"ROUND(B45*0.45,0)","v":8},null,{"$f":"(D46+D45+D47)","v":17},{"$f":"(D46+D45+D47)-F47","v":0},null,null,null,47]
[null,18,"Breakfast",{"$f":"ROUND(B48*0.25,0)","v":5},null,null,null,null,null,null,48]
[null,{"$f":"B48","v":18},"Lunch",{"$f":"ROUND(B48*0.3,0)","v":5},null,null,null,null,null,null,49]
[null,{"$f":"B48","v":18},"Dinner",{"$f":"ROUND(B48*0.45,0)","v":8},null,{"$f":"(D49+D48+D50)","v":18},{"$f":"(D49+D48+D50)-F50","v":0},null,null,null,50]
[null,19,"Breakfast",{"$f":"ROUND(B51*0.25,0)","v":5},null,null,null,null,null,null,51]
[null,{"$f":"B51","v":19},"Lunch",{"$f":"ROUND(B51*0.3,0)","v":6},null,null,null,null,null,null,52]
[null,{"$f":"B51","v":19},"Dinner",{"$f":"ROUND(B51*0.45,0)","v":9},null,{"$f":"(D52+D51+D53)","v":20},{"$f":"(D52+D51+D53)-F53","v":0},null,null,null,53]
[null,20,"Breakfast",{"$f":"ROUND(B54*0.25,0)","v":5},null,null,null,null,null,null,54]
[null,{"$f":"B54","v":20},"Lunch",{"$f":"ROUND(B54*0.3,0)","v":6},null,null,null,null,null,null,55]
[null,{"$f":"B54","v":20},"Dinner",{"$f":"ROUND(B54*0.45,0)","v":9},null,{"$f":"(D55+D54+D56)","v":20},{"$f":"(D55+D54+D56)-F56","v":0},null,null,null,56]
[null,21,"Breakfast",{"$f":"ROUND(B57*0.25,0)","v":5},null,null,null,null,null,null,57]
[null,{"$f":"B57","v":21},"Lunch",{"$f":"ROUND(B57*0.3,0)","v":6},null,null,null,null,null,null,58]
[null,{"$f":"B57","v":21},"Dinner",{"$f":"ROUND(B57*0.45,0)","v":9},null,{"$f":"(D58+D57+D59)","v":20},{"$f":"(D58+D57+D59)-F59","v":0},null,null,null,59]
[null,22,"Breakfast",{"$f":"ROUND(B60*0.25,0)","v":6},null,null,null,null,null,null,60]
[null,{"$f":"B60","v":22},"Lunch",{"$f":"ROUND(B60*0.3,0)","v":7},null,null,null,null,null,null,61]
[null,{"$f":"B60","v":22},"Dinner",{"$f":"ROUND(B60*0.45,0)","v":10},null,{"$f":"(D61+D60+D62)","v":23},{"$f":"(D61+D60+D62)-F62","v":0},null,null,null,62]
[null,23,"Breakfast",{"$f":"ROUND(B63*0.25,0)","v":6},null,null,null,null,null,null,63]
[null,{"$f":"B63","v":23},"Lunch",{"$f":"ROUND(B63*0.3,0)","v":7},null,null,null,null,null,null,64]
[null,{"$f":"B63","v":23},"Dinner",{"$f":"ROUND(B63*0.45,0)","v":10},null,{"$f":"(D64+D63+D65)","v":23},{"$f":"(D64+D63+D65)-F65","v":0},null,null,null,65]
[null,24,"Breakfast",{"$f":"ROUND(B66*0.25,0)","v":6},null,null,null,null,null,null,66]
[null,{"$f":"B66","v":24},"Lunch",{"$f":"ROUND(B66*0.3,0)","v":7},null,null,null,null,null,null,67]
[null,{"$f":"B66","v":24},"Dinner",{"$f":"ROUND(B66*0.45,0)","v":11},null,{"$f":"(D67+D66+D68)","v":24},{"$f":"(D67+D66+D68)-F68","v":0},null,null,null,68]
[null,25,"Breakfast",{"$f":"ROUND(B69*0.25,0)","v":6},null,null,null,null,null,null,69]
[null,{"$f":"B69","v":25},"Lunch",{"$f":"ROUND(B69*0.3,0)","v":8},null,null,null,null,null,null,70]
[null,{"$f":"B69","v":25},"Dinner",{"$f":"ROUND(B69*0.45,0)","v":11},null,{"$f":"(D70+D69+D71)","v":25},{"$f":"(D70+D69+D71)-F71","v":0},null,null,null,71]
[null,26,"Breakfast",{"$f":"ROUND(B72*0.25,0)","v":7},null,null,null,null,null,null,72]
[null,{"$f":"B72","v":26},"Lunch",{"$f":"ROUND(B72*0.3,0)","v":8},null,null,null,null,null,null,73]
[null,{"$f":"B72","v":26},"Dinner",{"$f":"ROUND(B72*0.45,0)","v":12},null,{"$f":"(D73+D72+D74)","v":27},{"$f":"(D73+D72+D74)-F74","v":0},null,null,null,74]
[null,27,"Breakfast",{"$f":"ROUND(B75*0.25,0)","v":7},null,null,null,null,null,null,75]
[null,{"$f":"B75","v":27},"Lunch",{"$f":"ROUND(B75*0.3,0)","v":8},null,null,null,null,null,null,76]
[null,{"$f":"B75","v":27},"Dinner",{"$f":"ROUND(B75*0.45,0)","v":12},null,{"$f":"(D76+D75+D77)","v":27},{"$f":"(D76+D75+D77)-F77","v":0},null,null,null,77]
[null,28,"Breakfast",{"$f":"ROUND(B78*0.25,0)","v":7},null,null,null,null,null,null,78]
[null,{"$f":"B78","v":28},"Lunch",{"$f":"ROUND(B78*0.3,0)","v":8},null,null,null,null,null,null,79]
[null,{"$f":"B78","v":28},"Dinner",{"$f":"ROUND(B78*0.45,0)","v":13},null,{"$f":"(D79+D78+D80)","v":28},{"$f":"(D79+D78+D80)-F80","v":0},null,null,null,80]
[null,29,"Breakfast",{"$f":"ROUND(B81*0.25,0)","v":7},null,null,null,null,null,null,81]
[null,{"$f":"B81","v":29},"Lunch",{"$f":"ROUND(B81*0.3,0)","v":9},null,null,null,null,null,null,82]
[null,{"$f":"B81","v":29},"Dinner",{"$f":"ROUND(B81*0.45,0)","v":13},null,{"$f":"(D82+D81+D83)","v":29},{"$f":"(D82+D81+D83)-F83","v":0},null,null,null,83]
[null,30,"Breakfast",{"$f":"ROUND(B84*0.25,0)","v":8},null,null,null,null,null,null,84]
[null,{"$f":"B84","v":30},"Lunch",{"$f":"ROUND(B84*0.3,0)","v":9},null,null,null,null,null,null,85]
[null,{"$f":"B84","v":30},"Dinner",{"$f":"ROUND(B84*0.45,0)","v":14},null,{"$f":"(D85+D84+D86)","v":31},{"$f":"(D85+D84+D86)-F86","v":0},null,null,null,86]
[null,31,"Breakfast",{"$f":"ROUND(B87*0.25,0)","v":8},null,null,null,null,null,null,87]
[null,{"$f":"B87","v":31},"Lunch",{"$f":"ROUND(B87*0.3,0)","v":9},null,null,null,null,null,null,88]
[null,{"$f":"B87","v":31},"Dinner",{"$f":"ROUND(B87*0.45,0)","v":14},null,{"$f":"(D88+D87+D89)","v":31},{"$f":"(D88+D87+D89)-F89","v":0},null,null,null,89]
[null,32,"Breakfast",{"$f":"ROUND(B90*0.25,0)","v":8},null,null,null,null,null,null,90]
[null,{"$f":"B90","v":32},"Lunch",{"$f":"ROUND(B90*0.3,0)","v":10},null,null,null,null,null,null,91]
[null,{"$f":"B90","v":32},"Dinner",{"$f":"ROUND(B90*0.45,0)","v":14},null,{"$f":"(D91+D90+D92)","v":32},{"$f":"(D91+D90+D92)-F92","v":0},null,null,null,92]
[null,33,"Breakfast",{"$f":"ROUND(B93*0.25,0)","v":8},null,null,null,null,null,null,93]
[null,{"$f":"B93","v":33},"Lunch",{"$f":"ROUND(B93*0.3,0)","v":10},null,null,null,null,null,null,94]
[null,{"$f":"B93","v":33},"Dinner",{"$f":"ROUND(B93*0.45,0)","v":15},null,{"$f":"(D94+D93+D95)","v":33},{"$f":"(D94+D93+D95)-F95","v":0},null,null,null,95]
[null,34,"Breakfast",{"$f":"ROUND(B96*0.25,0)","v":9},null,null,null,null,null,null,96]
[null,{"$f":"B96","v":34},"Lunch",{"$f":"ROUND(B96*0.3,0)","v":10},null,null,null,null,null,null,97]
[null,{"$f":"B96","v":34},"Dinner",{"$f":"ROUND(B96*0.45,0)","v":15},null,{"$f":"(D97+D96+D98)","v":34},{"$f":"(D97+D96+D98)-F98","v":0},null,null,null,98]
[null,35,"Breakfast",{"$f":"ROUND(B99*0.25,0)","v":9},null,null,null,null,null,null,99]
[null,{"$f":"B99","v":35},"Lunch",{"$f":"ROUND(B99*0.3,0)","v":11},null,null,null,null,null,null,100]
[null,{"$f":"B99","v":35},"Dinner",{"$f":"ROUND(B99*0.45,0)","v":16},null,{"$f":"(D100+D99+D101)","v":36},{"$f":"(D100+D99+D101)-F101","v":0},null,null,null,101]
[null,36,"Breakfast",{"$f":"ROUND(B102*0.25,0)","v":9},null,null,null,null,null,null,102]
[null,{"$f":"B102","v":36},"Lunch",{"$f":"ROUND(B102*0.3,0)","v":11},null,null,null,null,null,null,103]
[null,{"$f":"B102","v":36},"Dinner",{"$f":"ROUND(B102*0.45,0)","v":16},null,{"$f":"(D103+D102+D104)","v":36},{"$f":"(D103+D102+D104)-F104","v":0},null,null,null,104]
[null,37,"Breakfast",{"$f":"ROUND(B105*0.25,0)","v":9},null,null,null,null,null,null,105]
[null,{"$f":"B105","v":37},"Lunch",{"$f":"ROUND(B105*0.3,0)","v":11},null,null,null,null,null,null,106]
[null,{"$f":"B105","v":37},"Dinner",{"$f":"ROUND(B105*0.45,0)","v":17},null,{"$f":"(D106+D105+D107)","v":37},{"$f":"(D106+D105+D107)-F107","v":0},null,null,null,107]
[null,38,"Breakfast",{"$f":"ROUND(B108*0.25,0)","v":10},null,null,null,null,null,null,108]
[null,{"$f":"B108","v":38},"Lunch",{"$f":"ROUND(B108*0.3,0)","v":11},null,null,null,null,null,null,109]
[null,{"$f":"B108","v":38},"Dinner",{"$f":"ROUND(B108*0.45,0)","v":17},null,{"$f":"(D109+D108+D110)","v":38},{"$f":"(D109+D108+D110)-F110","v":0},null,null,null,110]
[null,39,"Breakfast",{"$f":"ROUND(B111*0.25,0)","v":10},null,null,null,null,null,null,111]
[null,{"$f":"B111","v":39},"Lunch",{"$f":"ROUND(B111*0.3,0)","v":12},null,null,null,null,null,null,112]
[null,{"$f":"B111","v":39},"Dinner",{"$f":"ROUND(B111*0.45,0)","v":18},null,{"$f":"(D112+D111+D113)","v":40},{"$f":"(D112+D111+D113)-F113","v":0},null,null,null,113]
[null,40,"Breakfast",{"$f":"ROUND(B114*0.25,0)","v":10},null,null,null,null,null,null,114]
[null,{"$f":"B114","v":40},"Lunch",{"$f":"ROUND(B114*0.3,0)","v":12},null,null,null,null,null,null,115]
[null,{"$f":"B114","v":40},"Dinner",{"$f":"ROUND(B114*0.45,0)","v":18},null,{"$f":"(D115+D114+D116)","v":40},{"$f":"(D115+D114+D116)-F116","v":0},null,null,null,116]
[null,41,"Breakfast",{"$f":"ROUND(B117*0.25,0)","v":10},null,null,null,null,null,null,117]
[null,{"$f":"B117","v":41},"Lunch",{"$f":"ROUND(B117*0.3,0)","v":12},null,null,null,null,null,null,118]
[null,{"$f":"B117","v":41},"Dinner",{"$f":"ROUND(B117*0.45,0)","v":18},null,{"$f":"(D118+D117+D119)","v":40},{"$f":"(D118+D117+D119)-F119","v":0},null,null,null,119]
[null,42,"Breakfast",{"$f":"ROUND(B120*0.25,0)","v":11},null,null,null,null,null,null,120]
{"$rows_left_out":1542}
{"sheet":"Formula","index":2,"n_rows":27,"n_cols":6,"rows_kept":27,"cut":false,"hidden":true,"merged":[]}
["Part","Code","Price","Find Part","Find Code"]
["x",11,5,"y",12,{"$f":"INDEX($C$2:$C$5,MATCH(D2,IF($B$2:$B$5=E2,$A$2:$A$5),0))","v":8}]
["x",12,6,"y",11,"=INDEX($C$2:$C$5,MATCH(D2,IF($B$2:$B$5=E2,$A$2:$A$5),0))"]
["y",11,7,"x",12,"ctrl + shift + enter"]
["y",12,8,"x",11]
[null,null,null,null,null,"https://support.microsoft.com/en-us/kb/214142"]
[null,null,null,null,null,"http://thinketg.com/say-goodbye-to-vlookup-and-hello-to-index-match/"]
[]
[]
["VBA Code"]
["CommandButton1"]
[]
["Private Sub CommandButton1_Click()"]
["Sheets(\"Calculation\").Range(\"C4\").Value = \"Yes\""]
["Sheets(\"Calculation\").Range(\"C5\").Value = \"1\""]
["Sheets(\"Calculation\").Range(\"C7\").Value = \"10\""]
["Sheets(\"Calculation\").Range(\"C8\").Value = \"Dinner\""]
["Sheets(\"Calculation\").Range(\"C11\").Value = \"0\""]
["Sheets(\"Calculation\").Range(\"C13\").Value = \"1\""]
["Sheets(\"Calculation\").Range(\"C14\").Value = \"1\""]
["Sheets(\"Calculation\").Range(\"C16\").Value = \"1\""]
["Sheets(\"Calculation\").Range(\"C20\").Value = \"No\""]
["Sheets(\"Calculation\").Range(\"C21\").Value = \"0\""]
[]
["MsgBox \"Form has been reset.\""]
[]
["End Sub"]